FreeBSD-main-amd64-test - Build #22687 - Still Unstable

From: <>
Date: Thu, 22 Dec 2022 11:48:36 UTC
FreeBSD-main-amd64-test - Build #22687 (453db42291a3179a51b9bf41ca7dbc0a5298bffa) - Still Unstable

Build information:
Full change log:
Full build log:

Status explanation:
"Unstable" - some tests are suspected being broken by the following changes
"Still Unstable" - the failing test cases have not been fixed by these
                   following changes and this is a notification to note that
                   these changes have not been fully tested by the CI system

Change summaries:
(Those commits are likely but not certainly responsible)

453db42291a3179a51b9bf41ca7dbc0a5298bffa by rene:
gpioevents: add support for pull-down and floating input pins.

The failed test cases:

4 tests failed.
FAILED:  sys.netpfil.common.dummynet.pf_queue

Error Message:
We failed prioritisation 1 times

FAILED:  sys.aio.aio_test.aio_socket_blocking_short_write

Error Message:
Test case body timed out

FAILED:  sys.aio.aio_test.aio_socket_blocking_short_write_vectored

Error Message:
Test case body timed out

FAILED:  sys.aio.aio_test.aio_socket_short_write_cancel

Error Message:
/usr/src/tests/sys/aio/aio_test.c:1396: aio_error(&iocb) == EINPROGRESS not met