FreeBSD-main-amd64-test - Build #22686 - Still Unstable

From: <>
Date: Thu, 22 Dec 2022 07:41:54 UTC
FreeBSD-main-amd64-test - Build #22686 (702b53dd2af4851f95c025a08a2029f9e67ba1bf) - Still Unstable

Build information:
Full change log:
Full build log:

Status explanation:
"Unstable" - some tests are suspected being broken by the following changes
"Still Unstable" - the failing test cases have not been fixed by these
                   following changes and this is a notification to note that
                   these changes have not been fully tested by the CI system

Change summaries:
(Those commits are likely but not certainly responsible)

702b53dd2af4851f95c025a08a2029f9e67ba1bf by ganbold:
Add initial support for the RK356X SOC Ethernet QoS controller

The failed test cases:

3 tests failed.
FAILED:  sys.aio.aio_test.aio_socket_blocking_short_write

Error Message:
Test case body timed out

FAILED:  sys.aio.aio_test.aio_socket_blocking_short_write_vectored

Error Message:
Test case body timed out

FAILED:  sys.aio.aio_test.aio_socket_short_write_cancel

Error Message:
/usr/src/tests/sys/aio/aio_test.c:1396: aio_error(&iocb) == EINPROGRESS not met