FreeBSD-main-amd64-test - Build #22685 - Still Unstable

From: <>
Date: Thu, 22 Dec 2022 06:01:55 UTC
FreeBSD-main-amd64-test - Build #22685 (777e472cd86b9394d07bf96c19dbafc2e1ff4fdc) - Still Unstable

Build information:
Full change log:
Full build log:

Status explanation:
"Unstable" - some tests are suspected being broken by the following changes
"Still Unstable" - the failing test cases have not been fixed by these
                   following changes and this is a notification to note that
                   these changes have not been fully tested by the CI system

Change summaries:
(Those commits are likely but not certainly responsible)

777e472cd86b9394d07bf96c19dbafc2e1ff4fdc by erj:
irdma(4): Upgrade driver to 1.1.5-k

The failed test cases:

3 tests failed.
FAILED:  sys.aio.aio_test.aio_socket_blocking_short_write

Error Message:
Test case body timed out

FAILED:  sys.aio.aio_test.aio_socket_blocking_short_write_vectored

Error Message:
Test case body timed out

FAILED:  sys.aio.aio_test.aio_socket_short_write_cancel

Error Message:
/usr/src/tests/sys/aio/aio_test.c:1396: aio_error(&iocb) == EINPROGRESS not met