FreeBSD-main-amd64-test - Build #22689 - Still Unstable

From: <>
Date: Thu, 22 Dec 2022 18:09:48 UTC
FreeBSD-main-amd64-test - Build #22689 (2eee99f794800124a7cc288763fcd8f8ae35935b) - Still Unstable

Build information:
Full change log:
Full build log:

Status explanation:
"Unstable" - some tests are suspected being broken by the following changes
"Still Unstable" - the failing test cases have not been fixed by these
                   following changes and this is a notification to note that
                   these changes have not been fully tested by the CI system

Change summaries:
(Those commits are likely but not certainly responsible)

f9ccec823a9f759ad6360c2a0c6336a3e2a6188a by andrew:
Add support for the new Arm Generic UART _HID

2eee99f794800124a7cc288763fcd8f8ae35935b by andrew:
Allow CPUs to be missing in the Arm PMU driver

The failed test cases:

4 tests failed.
FAILED:  sys.fs.fusefs.symlink.main

Error Message:
Returned non-success exit status 1

FAILED:  sys.aio.aio_test.aio_socket_blocking_short_write

Error Message:
Test case body timed out

FAILED:  sys.aio.aio_test.aio_socket_blocking_short_write_vectored

Error Message:
Test case body timed out

FAILED:  sys.aio.aio_test.aio_socket_short_write_cancel

Error Message:
/usr/src/tests/sys/aio/aio_test.c:1396: aio_error(&iocb) == EINPROGRESS not met