FreeBSD-main-amd64-test - Build #22680 - Still Unstable

From: <>
Date: Wed, 21 Dec 2022 17:32:06 UTC
FreeBSD-main-amd64-test - Build #22680 (402810d32e5f7525c61ef70c6af24817227e1649) - Still Unstable

Build information:
Full change log:
Full build log:

Status explanation:
"Unstable" - some tests are suspected being broken by the following changes
"Still Unstable" - the failing test cases have not been fixed by these
                   following changes and this is a notification to note that
                   these changes have not been fully tested by the CI system

Change summaries:
(Those commits are likely but not certainly responsible)

402810d32e5f7525c61ef70c6af24817227e1649 by jhibbits:
Convert iflib(4) and iflib-based drivers to the DrvAPI

The failed test cases:

4 tests failed.
FAILED:  sys.fs.fusefs.symlink.main

Error Message:
Returned non-success exit status 1

FAILED:  sys.aio.aio_test.aio_socket_blocking_short_write

Error Message:
Test case body timed out

FAILED:  sys.aio.aio_test.aio_socket_blocking_short_write_vectored

Error Message:
Test case body timed out

FAILED:  sys.aio.aio_test.aio_socket_short_write_cancel

Error Message:
/usr/src/tests/sys/aio/aio_test.c:1396: aio_error(&iocb) == EINPROGRESS not met