FreeBSD-main-amd64-test - Build #22679 - Still unstable

From: <>
Date: Wed, 21 Dec 2022 14:27:17 UTC
FreeBSD-main-amd64-test - Build #22679 (7ebc4c9bf76d1ea62e2ccd3020ff8e6e293b499c) - Still unstable

Build information:
Full change log:
Full build log:

Status explanation:
"Unstable" - some tests are suspected being broken by the following changes
"Still Unstable" - the failing test cases have not been fixed by these
                   following changes and this is a notification to note that
                   these changes have not been fully tested by the CI system

Change summaries:
(Those commits are likely but not certainly responsible)

969935b86b179b2b517ab5d35d943fcb761203c1 by andrew:
Add support for an array of hwresets

7ebc4c9bf76d1ea62e2ccd3020ff8e6e293b499c by andrew:
Use hwreset_array in the Rockchip tsadc driver

The failed test cases:

4 tests failed.
FAILED:  sys.netinet6.lpm6.lpm6_test1_success

Error Message:
atf-check failed; see the output of the test for details

FAILED:  sys.aio.aio_test.aio_socket_blocking_short_write

Error Message:
Test case body timed out

FAILED:  sys.aio.aio_test.aio_socket_blocking_short_write_vectored

Error Message:
Test case body timed out

FAILED:  sys.aio.aio_test.aio_socket_short_write_cancel

Error Message:
/usr/src/tests/sys/aio/aio_test.c:1396: aio_error(&iocb) == EINPROGRESS not met