FreeBSD-main-amd64-test - Build #22681 - Still Unstable

From: <>
Date: Wed, 21 Dec 2022 21:02:07 UTC
FreeBSD-main-amd64-test - Build #22681 (bb1f0401d6bd5630bbb5e67d607d5551178933a1) - Still Unstable

Build information:
Full change log:
Full build log:

Status explanation:
"Unstable" - some tests are suspected being broken by the following changes
"Still Unstable" - the failing test cases have not been fixed by these
                   following changes and this is a notification to note that
                   these changes have not been fully tested by the CI system

Change summaries:
(Those commits are likely but not certainly responsible)

e00b6e254f8b5d052214fd9eb609b333140c42ce by ganbold:
Attach Motorcomm YT8511 GbE PHY driver to the build.

4b4e8cb53abc1651e2f85c939c81393f05bd5fb9 by br:
smmu: set guest address space range to 48-bit, which is a hardware

dc08d52d1ed98593fbfe769a42e18de6a578d1f7 by br:
smmu: fix FDT and !FDT builds.

bb1f0401d6bd5630bbb5e67d607d5551178933a1 by osa:
bsd-family-tree: macOS 13 added

The failed test cases:

3 tests failed.
FAILED:  sys.aio.aio_test.aio_socket_blocking_short_write

Error Message:
Test case body timed out

FAILED:  sys.aio.aio_test.aio_socket_blocking_short_write_vectored

Error Message:
Test case body timed out

FAILED:  sys.aio.aio_test.aio_socket_short_write_cancel

Error Message:
/usr/src/tests/sys/aio/aio_test.c:1396: aio_error(&iocb) == EINPROGRESS not met