FreeBSD-main-amd64-test - Build #22671 - Still Unstable

From: <>
Date: Tue, 20 Dec 2022 11:52:51 UTC
FreeBSD-main-amd64-test - Build #22671 (1d8c07b7ab7bc123ec62e97176beffef4052eba8) - Still Unstable

Build information:
Full change log:
Full build log:

Status explanation:
"Unstable" - some tests are suspected being broken by the following changes
"Still Unstable" - the failing test cases have not been fixed by these
                   following changes and this is a notification to note that
                   these changes have not been fully tested by the CI system

Change summaries:
(Those commits are likely but not certainly responsible)

1d8c07b7ab7bc123ec62e97176beffef4052eba8 by ganbold:
Get clocks for Rockchip RK3568.

The failed test cases:

3 tests failed.
FAILED:  sys.aio.aio_test.aio_socket_blocking_short_write

Error Message:
Test case body timed out

FAILED:  sys.aio.aio_test.aio_socket_blocking_short_write_vectored

Error Message:
Test case body timed out

FAILED:  sys.aio.aio_test.aio_socket_short_write_cancel

Error Message:
/usr/src/tests/sys/aio/aio_test.c:1396: aio_error(&iocb) == EINPROGRESS not met