FreeBSD-main-amd64-test - Build #22670 - Still Unstable

From: <>
Date: Tue, 20 Dec 2022 06:58:13 UTC
FreeBSD-main-amd64-test - Build #22670 (b13110e9f3cad590abb86519e313eb1449ddc2e7) - Still Unstable

Build information:
Full change log:
Full build log:

Status explanation:
"Unstable" - some tests are suspected being broken by the following changes
"Still Unstable" - the failing test cases have not been fixed by these
                   following changes and this is a notification to note that
                   these changes have not been fully tested by the CI system

Change summaries:
(Those commits are likely but not certainly responsible)

9a5acf365db3b94338220bd354041727dffcb77c by des:
nvme: Clear the notify flag if the consumer rejects the controller.

e7815784cc28e923892ddcb30a1084870abd77ad by ganbold:
Add Rockchip RK3568 SoC

b13110e9f3cad590abb86519e313eb1449ddc2e7 by alfredo:
ufs/ffs: detect endian mismatch between machine and filesystem

The failed test cases:

4 tests failed.
FAILED:  sys.fs.fusefs.mknod.main

Error Message:
Returned non-success exit status 1

FAILED:  sys.aio.aio_test.aio_socket_blocking_short_write

Error Message:
Test case body timed out

FAILED:  sys.aio.aio_test.aio_socket_blocking_short_write_vectored

Error Message:
Test case body timed out

FAILED:  sys.aio.aio_test.aio_socket_short_write_cancel

Error Message:
/usr/src/tests/sys/aio/aio_test.c:1396: aio_error(&iocb) == EINPROGRESS not met