FreeBSD-main-amd64-test - Build #22672 - Still Unstable

From: <>
Date: Tue, 20 Dec 2022 14:01:58 UTC
FreeBSD-main-amd64-test - Build #22672 (ae521fda895ff0b5076904f08ec92e3c60d53701) - Still Unstable

Build information:
Full change log:
Full build log:

Status explanation:
"Unstable" - some tests are suspected being broken by the following changes
"Still Unstable" - the failing test cases have not been fixed by these
                   following changes and this is a notification to note that
                   these changes have not been fully tested by the CI system

Change summaries:
(Those commits are likely but not certainly responsible)

eeabf9cb937a8a98b17a434cc79f755fe01b0d03 by pho:
stress2: Fix long run time

ae521fda895ff0b5076904f08ec92e3c60d53701 by pho:
stress2: Added link to problem found

The failed test cases:

4 tests failed.
FAILED:  sys.fs.fusefs.mknod.main

Error Message:
Returned non-success exit status 1

FAILED:  sys.aio.aio_test.aio_socket_blocking_short_write

Error Message:
Test case body timed out

FAILED:  sys.aio.aio_test.aio_socket_blocking_short_write_vectored

Error Message:
Test case body timed out

FAILED:  sys.aio.aio_test.aio_socket_short_write_cancel

Error Message:
/usr/src/tests/sys/aio/aio_test.c:1396: aio_error(&iocb) == EINPROGRESS not met