Fails to install editors/libreoffice

Гуляев Гоша gosha-necr at
Wed Apr 20 16:06:09 UTC 2011

<div>Hi all! I'm try to install editors/libreoffice on my machine:</div><div>OS: &nbsp;8.2-STABLE FreeBSD 8.2-STABLE #0: Wed Apr 20 15:18:53 YEKST 2011 &nbsp;i386</div><div>ls /var/db/pkg | grep jdk</div><div>diablo-jdk-<br />jdk-</div><div>&nbsp;</div><div>RAM: 2Gb + 4Gb swap file</div><div>Hard disk space 29Gb</div><div>&nbsp;</div><div>I'm try disable all options, and try enable KDE + JAVA and KDE w/o JAVA.</div><div>&nbsp;</div><div>there is output of error:</div><div>&nbsp;</div><div>Entering /var/XXX/libreoffice-build-<br /><br />Making:    sdbc_hsqldb.dpj<br /><br />dmake: Executing shell macro: cd $(MISC)/registry/data/org/openoffice/Office/DataAccess &amp;&amp;      ls *.xcu<br />/usr/local/jdk1.6.0/bin/javac -source 1.5 -target 1.5 -classpath ".:../../../../../../" -d ../../../../../../  @/tmp/mkUcfJf6<br />terminate called after throwing an instance of 'com::sun::star::lang::IllegalArgumentException'<br />/usr/local/bin/bash: line 1:  2894 Abort trap: 6           LD_LIBRARY_PATH=${LD_LIBRARY_PATH+${LD_LIBRARY_PATH}:}/var/XXX/libreoffice-build- /var/XXX/libreoffice-build- ../../<br />dmake:  Error code 134, while making 'test1'<br />Making:    sdbc_hsqldb.dpj<br /><br />echo "Class-Path: hsqldb.jar  .." &gt;&gt; ../../../../../../<br />updating: META-INF/MANIFEST.MF (deflated 7%)<br />updating: com/sun/star/sdbcx/comp/hsqldb/NativeInputStreamHelper.class (deflated 55%)<br />updating: com/sun/star/sdbcx/comp/hsqldb/StorageNativeInputStream.class (deflated 51%)<br />updating: com/sun/star/sdbcx/comp/hsqldb/NativeOutputStreamHelper.class (deflated 56%)<br />updating: com/sun/star/sdbcx/comp/hsqldb/StorageNativeOutputStream.class (deflated 50%)<br />updating: com/sun/star/sdbcx/comp/hsqldb/NativeStorageAccess.class (deflated 53%)<br />updating: com/sun/star/sdbcx/comp/hsqldb/StorageAccess.class (deflated 54%)<br />updating: com/sun/star/sdbcx/comp/hsqldb/StorageFileAccess$FileSync.class (deflated 52%)<br />updating: com/sun/star/sdbcx/comp/hsqldb/StorageFileAccess.class (deflated 57%)<br />updating: com/sun/star/sdbcx/comp/hsqldb/NativeLibraries.class (deflated 46%)<br />updating: org/hsqldb/lib/FileSystemRuntimeException.class (deflated 48%)<br />connectivity deliver<br />Module 'connectivity' delivered successfully. 0 files copied, 115 files unchanged<br /><br />-----------------------------------------------------------------------<br /> Oh dear - something failed during the build - sorry !<br /> For more help with debugging build errors, please see the section in:<br /><br /><br /> internal build errors:<br /><br />ERROR: error 65280 occurred while making /var/XXX/libreoffice-build-<br />ERROR: error 65280 occurred while making /var/XXX/libreoffice-build-<br /><br /> it seems you are using a threaded build, which means that the<br /> actual compile error is probably hidden far above, and could be<br /> inside any of these other modules:<br /> sfx2<br /> please re-run build inside each one to isolate the problem.<br />-----------------------------------------------------------------------<br /><br />/usr/local/bin/bash<br />cd /var/XXX/libreoffice-build-<br />source ./<br />cd pyuno<br />build<br /><br />when the problem is isolated and fixed exit and re-run 'make' from the top-level<br />sometimes (sadly) it is necessary to rm -Rf in a module.<br />gmake: *** [stamp/build] Ошибка 1<br />*** Error code 1<br /><br />Stop in /usr/ports/editors/libreoffice.<br />*** Error code 1<br /><br />Stop in /usr/ports/editors/libreoffice.</div>

More information about the freebsd-questions mailing list