Enlightenment build failure

Piotrek piokud84 at gmail.com
Thu Mar 18 11:47:18 UTC 2010


FreeBSD sng 8.0-STABLE FreeBSD 8.0-STABLE #0: Wed Mar 17 10:09:21 CET
2010     sng at sng:/usr/obj/usr/src/sys/DESKTOP-DEBUG  amd64

When i try to install /usr/ports/x11-wm/enlightenment i end up with
following message:

(cd .libs && rm -f module.la && ln -s ../module.la module.la)
gmake[4]: Opuszczenie katalogu
`/usr/ports/x11-wm/enlightenment/work/enlightenment-0.16.999.042/src/modules/conf_imc'
Making all in msgbus_lang gmake[4]: Wejście do katalogu
`/usr/ports/x11-wm/enlightenment/work/enlightenment-0.16.999.042/src/modules/msgbus_lang'
if /bin/sh ../../../libtool --tag=CC --mode=compile cc -DHAVE_CONFIG_H
-I. -I. -I../../.. -I. -I../../.. -I../../../src/modules/msgbus_lang
-I../../../src/bin -I../../../src/lib -I../../../src/modules
-DUSE_E_CONFIG_H -I/usr/local/include -I/usr/local/include/efreet
-I/usr/local/include -I/usr/local/include/dbus-1.0
-I/usr/local/include/dbus-1.0/include     -I/usr/local/include
-I/usr/local/include -O2 -pipe -fno-strict-aliasing -MT e_mod_main.lo
-MD -MP -MF ".deps/e_mod_main.Tpo" -c -o e_mod_main.lo e_mod_main.c; \
then mv -f ".deps/e_mod_main.Tpo" ".deps/e_mod_main.Plo"; else rm -f
".deps/e_mod_main.Tpo"; exit 1; fi mkdir .libs cc -DHAVE_CONFIG_H -I.
-I. -I../../.. -I. -I../../.. -I../../../src/modules/msgbus_lang
-I../../../src/bin -I../../../src/lib -I../../../src/modules
-DUSE_E_CONFIG_H -I/usr/local/include -I/usr/local/include/efreet
-I/usr/local/include -I/usr/local/include/dbus-1.0
-I/usr/local/include/dbus-1.0/include -I/usr/local/include
-I/usr/local/include -O2 -pipe -fno-strict-aliasing -MT e_mod_main.lo
-MD -MP -MF .deps/e_mod_main.Tpo -c e_mod_main.c  -fPIC -DPIC
-o .libs/e_mod_main.o e_mod_main.c:19: error: expected '=', ',', ';',
'asm' or '__attribute__' before '*' token e_mod_main.c: In function
'e_modapi_init': e_mod_main.c:62: warning: assignment makes pointer
from integer without a cast e_mod_main.c:65: error: 'cb_langs'
undeclared (first use in this function) e_mod_main.c:65: error: (Each
undeclared identifier is reported only once e_mod_main.c:65: error: for
each function it appears in.) gmake[4]: *** [e_mod_main.lo] Błąd 1 gmake
[4]: Opuszczenie katalogu
`/usr/ports/x11-wm/enlightenment/work/enlightenment-0.16.999.042/src/modules/msgbus_lang'
gmake[3]: *** [all-recursive] Błąd 1 gmake[3]: Opuszczenie katalogu
`/usr/ports/x11-wm/enlightenment/work/enlightenment-0.16.999.042/src/modules'
gmake[2]: *** [all-recursive] Błąd 1 gmake[2]: Opuszczenie katalogu
`/usr/ports/x11-wm/enlightenment/work/enlightenment-0.16.999.042/src'
gmake[1]: *** [all-recursive] Błąd 1 gmake[1]: Opuszczenie katalogu
`/usr/ports/x11-wm/enlightenment/work/enlightenment-0.16.999.042'
gmake: *** [all] Błąd 2 *** Error code 1

Stop in /usr/ports/x11-wm/enlightenment.

I'll be very happy if someone will fix it :)

Best regards
-- 
Piotrek <piokud84 at gmail.com>


More information about the freebsd-ports mailing list