cannot build sysutils/kdelibs3

Dominic Fandrey kamikaze at bsdforen.de
Sat Jun 5 18:34:45 UTC 2010


Apparently ASN1_METHOD has long been deprecated and now
removed. No idea what to do about it. I cannot switch back
to base system ssl, without breaking a lot of other ports.

/bin/sh /usr/local/bin/libtool --silent --tag=CXX   --mode=compile c++ -DHAVE_CONFIG_H -I. -I../.. -I../../dcop -I../../kdecore -I../../kjs -I../../kdecore/network -I../../kwallet/client -I../../dcop -I../../libltdl -I../../kdefx -I../../kdecore -I../../kdecore -I../../kdecore/network -I../../kdeui -I../../kio -I../../kio/kio -I../../kio/kfile -I../..  -I/usr/local/include -I/usr/local/include -I/usr/local/include   -D_THREAD_SAFE -pthread -DQT_THREAD_SUPPORT   -I/usr/local/include -I/usr/local/include  -I/usr/local/include -D_GETOPT_H -D_THREAD_SAFE   -Wno-long-long -Wundef -Wall -W -Wpointer-arith -DNDEBUG -DNO_DEBUG -O2 -O2 -pipe -march=nocona -fno-strict-aliasing -Wno-non-virtual-dtor -fno-exceptions -fno-check-new -fno-common  -DQT_CLEAN_NAMESPACE -DQT_NO_ASCII_CAST -DQT_NO_STL -DQT_NO_COMPAT -DQT_NO_TRANSLATION  -MT kssl.lo -MD -MP -MF .deps/kssl.Tpo -c -o kssl.lo kssl.cc
In file included from kssl.cc:47:
./kopenssl.h:453: error: ISO C++ forbids declaration of 'ASN1_METHOD' with no type
./kopenssl.h:453: error: expected ';' before '*' token
./kopenssl.h:526: error: expected ';' before '(' token
./kopenssl.h:532: error: 'STACK' has not been declared
./kopenssl.h:538: error: 'STACK' has not been declared
./kopenssl.h:544: error: expected ';' before '(' token
./kopenssl.h:550: error: ISO C++ forbids declaration of 'STACK' with no type
./kopenssl.h:550: error: expected ';' before '*' token
./kopenssl.h:556: error: 'STACK' has not been declared
./kopenssl.h:562: error: ISO C++ forbids declaration of 'STACK' with no type
./kopenssl.h:562: error: expected ';' before '*' token
./kopenssl.h:828: error: ISO C++ forbids declaration of 'STACK' with no type
./kopenssl.h:828: error: expected ';' before '*' token
./kopenssl.h:829: error: 'STACK' has not been declared
kssl.cc: In member function 'void KSSL::setPeerInfo()':
kssl.cc:616: error: 'class KOpenSSLProxy' has no member named 'sk_dup'
gmake[5]: *** [kssl.lo] Error 1
gmake[5]: Leaving directory `/usr/obj/mobileKamikaze.norad/amd64/usr/ports/x11/kdelibs3/work/kdelibs-3.5.10/kio/kssl'
gmake[4]: *** [all-recursive] Error 1
gmake[4]: Leaving directory `/usr/obj/mobileKamikaze.norad/amd64/usr/ports/x11/kdelibs3/work/kdelibs-3.5.10/kio/kssl'
gmake[3]: *** [all] Error 2
gmake[3]: Leaving directory `/usr/obj/mobileKamikaze.norad/amd64/usr/ports/x11/kdelibs3/work/kdelibs-3.5.10/kio/kssl'
gmake[2]: *** [all-recursive] Error 1
gmake[2]: Leaving directory `/usr/obj/mobileKamikaze.norad/amd64/usr/ports/x11/kdelibs3/work/kdelibs-3.5.10/kio'
gmake[1]: *** [all-recursive] Error 1
gmake[1]: Leaving directory `/usr/obj/mobileKamikaze.norad/amd64/usr/ports/x11/kdelibs3/work/kdelibs-3.5.10'
gmake: *** [all] Error 2
*** Error code 1

Stop in /usr/ports/x11/kdelibs3.

===>>> make failed for x11/kdelibs3
===>>> Aborting update


More information about the freebsd-ports mailing list