Install kdelibs3 on 6.2

Martin Schweizer schweizer.martin at
Mon Oct 29 22:48:53 PDT 2007


While I'm installing kdelibs3 I get the following error:

(I did post it also in freebsd-questions@ without any response.)

gmake[4]: Leaving directory

gmake[4]: Entering directory

if /bin/sh /usr/local/bin/libtool --silent --tag=CXX --mode=compile
c++ -DHAVE_CONFIG_H -I. -I. -I../.. -I../../dcop -I../../kdecore
-I../../kio/kssl -I../../kjs -I../.. -I../../kio -I../../kfile
-I../../kdeprint -I../../kdeprint/management -I../../kdecore/network
-I../../dcop -I../../libltdl -I../../kdefx -I../../kdecore
-I../../kdecore -I../../kdecore/network -I../../kdeui -I../../kio
-I../../kio/kio -I../../kio/kfile -I../..  -I/usr/local/include
-I/usr/local/include -I/usr/local/include -D_KDEPRINT_COMPILE
-D_THREAD_SAFE -pthread -DQT_THREAD_SUPPORT   -I/usr/local/include
-I/usr/local/include  -I/usr/local/include -D_GETOPT_H -D_THREAD_SAFE
 -Wno-long-long -Wundef -Wall -W -Wpointer-arith -DNDEBUG -DNO_DEBUG
-O2 -O2 -fno-strict-aliasing -pipe -Wno-non-virtual-dtor
-fno-exceptions -fno-check-new -fno-common  -DQT_CLEAN_NAMESPACE
ipprequest.lo -MD -MP -MF ".deps/ipprequest.Tpo" -c -o ipprequest.lo
ipprequest.cpp; \

	then mv -f ".deps/ipprequest.Tpo" ".deps/ipprequest.Plo"; else rm -f
".deps/ipprequest.Tpo"; exit 1; fi

ipprequest.cpp: In member function `bool
IppRequest::doFileRequest(const QString&, const QString&)':

ipprequest.cpp:313: error: `httpSetAuthString' was not declared in this scope

ipprequest.cpp:323: error: `httpGetAuthString' was not declared in this scope

ipprequest.cpp:313: warning: unused variable 'httpSetAuthString'

ipprequest.cpp:323: warning: unused variable 'httpGetAuthString'

gmake[4]: *** [ipprequest.lo] Fehler 1

gmake[4]: Leaving directory

gmake[3]: *** [all-recursive] Fehler 1

gmake[3]: Leaving directory

gmake[2]: *** [all-recursive] Fehler 1

gmake[2]: Leaving directory

gmake[1]: *** [all-recursive] Fehler 1

gmake[1]: Leaving directory `/usr/ports/x11/kdelibs3/work/kdelibs-3.5.7'

gmake: *** [all] Fehler 2

*** Error code 2

Stop in /usr/ports/x11/kdelibs3.

I also read the PR 116767 but I did not find this patch in kdelibs3/files. I
also install the newest printer/cups but without success. What do I'm wrong?

Martin Schweizer
schweizer.martin at
Tel.: +41 32 512 48 54 (VoIP)
Fax: +1 619 3300587

More information about the freebsd-ports mailing list