FreeBSD-stable-15-amd64-test - Build #1133 - Still Unstable

From: <jenkins-admin_at_FreeBSD.org>
Date: Wed, 30 Sep 2026 12:11:41 UTC
FreeBSD-stable-15-amd64-test - Build #1133 (107212618921492ffed84d6ea3c9a27c77aaf725) - Still Unstable

Build information: https://ci.FreeBSD.org/job/FreeBSD-stable-15-amd64-test/1133/
Full change log: https://ci.FreeBSD.org/job/FreeBSD-stable-15-amd64-test/1133/changes
Full build log: https://ci.FreeBSD.org/job/FreeBSD-stable-15-amd64-test/1133/console

Status explanation:
"Unstable" - some tests are suspected being broken by the following changes
"Still Unstable" - the failing test cases have not been fixed by these
                   following changes and this is a notification to note that
                   these changes have not been fully tested by the CI system

Change summaries:
(Those commits are likely but not certainly responsible)

edb560a7ccd69440e3bcd3e00ad9b347328f1be3 by pkubaj:
sys/powerpc/powerpc/elf64_machdep.c: enable ASLR on ELFv2

107212618921492ffed84d6ea3c9a27c77aaf725 by pkubaj:
powerpc/radix: fix double page offset in mmu_radix_sync_icache()



The failed test cases:

3 tests failed.
FAILED:  sys.fs.fusefs.ctl.remove_lun_with_atime

Error Message:
atf-check failed; see the output of the test for details

FAILED:  sys.netpfil.pf.pfsync.bulk

Error Message:
state not found on synced host

FAILED:  lib.libexecinfo.sigtramp_test.test_backtrace_sigtramp

Error Message:
/usr/src/lib/libexecinfo/tests/sigtramp_test.c:30: n > 1 not met