FreeBSD-stable-15-amd64-test - Build #1132 - Still Unstable
Date: Wed, 30 Sep 2026 09:04:20 UTC
FreeBSD-stable-15-amd64-test - Build #1132 (42f9573827e9642410c4c99e42549ee7a1beca00) - Still Unstable
Build information: https://ci.FreeBSD.org/job/FreeBSD-stable-15-amd64-test/1132/
Full change log: https://ci.FreeBSD.org/job/FreeBSD-stable-15-amd64-test/1132/changes
Full build log: https://ci.FreeBSD.org/job/FreeBSD-stable-15-amd64-test/1132/console
Status explanation:
"Unstable" - some tests are suspected being broken by the following changes
"Still Unstable" - the failing test cases have not been fixed by these
following changes and this is a notification to note that
these changes have not been fully tested by the CI system
Change summaries:
(Those commits are likely but not certainly responsible)
c3e55f4b5d535b6ec7c46736a9c95295bbf0918d by jrtc27:
bhyve: rtc_pl031: Fix PeriphID and CellID values
1eacca685601172d18bc7d25db0d6ad1c35a3b30 by osa:
bsd-family-tree: add NetBSD 9.5 and FreeBSD 14.5
493231a346bcb84f078e7c50230218c2b37a87cb by osa:
bsd-family-tree: add NetBSD 10.2
c121ed33cde56dd2bf019ffe22c47b12f134b8c9 by kib:
linuxkpi: Fix double-cleanup in linux_pci_attach_device() error path
f07c4f64bb0f74fadf85d48cb2833f7c63b0d4bd by eugen:
me.4: MFC: note that it is a point-to-point interface
42f9573827e9642410c4c99e42549ee7a1beca00 by eugen:
traceroute6: MFC: implement firewall evasion mode
The failed test cases:
3 tests failed.
FAILED: sys.fs.fusefs.ext2-misc.execute
Error Message:
atf-check failed; see the output of the test for details
FAILED: sys.netpfil.pf.pfsync.bulk
Error Message:
state not found on synced host
FAILED: lib.libexecinfo.sigtramp_test.test_backtrace_sigtramp
Error Message:
/usr/src/lib/libexecinfo/tests/sigtramp_test.c:30: n > 1 not met