FreeBSD-main-amd64-test - Build #29565 - Still Unstable
Date: Sat, 26 Sep 2026 20:44:11 UTC
FreeBSD-main-amd64-test - Build #29565 (e2d42b0e6cc235c56484e274639b1df00c99760b) - Still Unstable
Build information: https://ci.FreeBSD.org/job/FreeBSD-main-amd64-test/29565/
Full change log: https://ci.FreeBSD.org/job/FreeBSD-main-amd64-test/29565/changes
Full build log: https://ci.FreeBSD.org/job/FreeBSD-main-amd64-test/29565/console
Status explanation:
"Unstable" - some tests are suspected being broken by the following changes
"Still Unstable" - the failing test cases have not been fixed by these
following changes and this is a notification to note that
these changes have not been fully tested by the CI system
Change summaries:
(Those commits are likely but not certainly responsible)
22039031a15238c69497bbd9d8dea3cd97ee6bc6 by seuros:
nvme: name the reserved Identify Controller fields at bytes 102 through
12c3004129466634cbe5c34a1049dc0d5ecdff3b by mmel:
dpaa2: Don't return simplebus devinfo for a non-simplebus child
e2d42b0e6cc235c56484e274639b1df00c99760b by mmel:
ofw: Convert simplebus to device_get_softc_class().
The failed test cases:
9 tests failed.
FAILED: sys.netinet6.ndp.ndp_prefix_lifetime
Error Message:
atf-check failed; see the output of the test for details
FAILED: sys.netpfil.pf.pfsync.bulk
Error Message:
state not found on synced host
FAILED: sys.kern.ssl_sendfile.eagain_vs_eof
Error Message:
/usr/src/tests/sys/kern/ssl_sendfile.c:485: c.sbytes == -1 not met
FAILED: lib.libexecinfo.sigtramp_test.test_backtrace_sigtramp
Error Message:
/usr/src/lib/libexecinfo/tests/sigtramp_test.c:30: n > 1 not met
FAILED: sys.kern.ssl_sendfile.truncate
Error Message:
Test case body timed out
FAILED: sys.kern.ssl_sendfile.grow
Error Message:
Test case body timed out
FAILED: sys.net.if_lagg_test.witness
Error Message:
Lock-order reversals involving if_lagg.c detected
FAILED: sys.netinet.udp_bindings.connect_bound_socket_from_2address_jail
Error Message:
/usr/src/tests/sys/netinet/udp_bindings.c:244: connect(s, (struct sockaddr *)&sin, sizeof(sin)) == 0 not met
FAILED: sys.netlink.netlink_socket.overflow
Error Message:
/usr/src/tests/sys/netlink/netlink_socket.c:146: send(fd, &hdr, sizeof(hdr), 0) == sizeof(hdr) not met