FreeBSD-main-amd64-test - Build #29564 - Still Unstable

From: <jenkins-admin_at_FreeBSD.org>
Date: Sat, 26 Sep 2026 18:06:46 UTC
FreeBSD-main-amd64-test - Build #29564 (228b1a011660ee1005bc4ab7c97113af8d87fe5c) - Still Unstable

Build information: https://ci.FreeBSD.org/job/FreeBSD-main-amd64-test/29564/
Full change log: https://ci.FreeBSD.org/job/FreeBSD-main-amd64-test/29564/changes
Full build log: https://ci.FreeBSD.org/job/FreeBSD-main-amd64-test/29564/console

Status explanation:
"Unstable" - some tests are suspected being broken by the following changes
"Still Unstable" - the failing test cases have not been fixed by these
                   following changes and this is a notification to note that
                   these changes have not been fully tested by the CI system

Change summaries:
(Those commits are likely but not certainly responsible)

58741fa51dc207123c18b3a4125af99cab798898 by imp:
boot-test.sh: Add virtio-rng-pci to the EFI RAM-disk netboot qemu

ab9130c737c718391cf5318a773ae500a955a4f9 by imp:
boot-test.sh: Add a http server per interface

a844bc229e8333e2eb88906a5566c9226ffdc2b2 by imp:
boot-test.sh: Add netboot-http-efi test

4f06a8e49099e597c42dac4588196eb934e6fcd2 by imp:
edk2: Import FileInfo.h from edk2-stable202502

9ecc2493ca5fbba852e175674b5cb8975b99af84 by imp:
Restore booting the partition the EFI boot image was loaded from.

d8acc2a9a431b4d57ef79b2ca3113ecf33b95d8d by imp:
boot-test.sh: Add gptboot.efi tests

228b1a011660ee1005bc4ab7c97113af8d87fe5c by aokblast:
uchcom: Set rate to 1 if 0



The failed test cases:

7 tests failed.
FAILED:  sys.kern.ssl_sendfile.eagain_vs_eof

Error Message:
/usr/src/tests/sys/kern/ssl_sendfile.c:485: c.sbytes == -1 not met

FAILED:  lib.libexecinfo.sigtramp_test.test_backtrace_sigtramp

Error Message:
/usr/src/lib/libexecinfo/tests/sigtramp_test.c:30: n > 1 not met

FAILED:  sys.kern.ssl_sendfile.truncate

Error Message:
Test case body timed out

FAILED:  sys.kern.ssl_sendfile.grow

Error Message:
Test case body timed out

FAILED:  sys.net.if_lagg_test.witness

Error Message:
Lock-order reversals involving if_lagg.c detected

FAILED:  sys.netinet.udp_bindings.connect_bound_socket_from_2address_jail

Error Message:
/usr/src/tests/sys/netinet/udp_bindings.c:244: connect(s, (struct sockaddr *)&sin, sizeof(sin)) == 0 not met

FAILED:  sys.netlink.netlink_socket.overflow

Error Message:
/usr/src/tests/sys/netlink/netlink_socket.c:146: send(fd, &hdr, sizeof(hdr), 0) == sizeof(hdr) not met