FreeBSD-main-amd64-test - Build #29538 - Still Unstable
Date: Tue, 22 Sep 2026 08:43:35 UTC
FreeBSD-main-amd64-test - Build #29538 (d90a75af95107782d18771c91b0bc8c74e6cc4f3) - Still Unstable
Build information: https://ci.FreeBSD.org/job/FreeBSD-main-amd64-test/29538/
Full change log: https://ci.FreeBSD.org/job/FreeBSD-main-amd64-test/29538/changes
Full build log: https://ci.FreeBSD.org/job/FreeBSD-main-amd64-test/29538/console
Status explanation:
"Unstable" - some tests are suspected being broken by the following changes
"Still Unstable" - the failing test cases have not been fixed by these
following changes and this is a notification to note that
these changes have not been fully tested by the CI system
Change summaries:
(Those commits are likely but not certainly responsible)
04fcf30961266cd77139b40774cb0d6ef6eb2be5 by maxim:
dummynet: do not overflow the points[ED_MAX_SAMPLES_NO] array
f6db138f97b78e641b07a7c3695ccf62b0f42f28 by ngie:
src.opts.mk: force the Dtrace tests off if ${MK_DTRACE} == no
df6131e2b74d9f334c16387e9a46cafd6e27eb78 by ngie:
Remove CDDL and ctfconvert tests when their controlling knobs are
d90a75af95107782d18771c91b0bc8c74e6cc4f3 by ngie:
src.conf(5): regenerate after f6db138f97b7
The failed test cases:
9 tests failed.
FAILED: sys.netpfil.pf.pfsync.bulk
Error Message:
state not found on synced host
FAILED: lib.libexecinfo.sigtramp_test.test_backtrace_sigtramp
Error Message:
/usr/src/lib/libexecinfo/tests/sigtramp_test.c:30: n > 1 not met
FAILED: sys.kern.ssl_sendfile.eagain_vs_eof
Error Message:
/usr/src/tests/sys/kern/ssl_sendfile.c:485: c.sbytes == -1 not met
FAILED: sys.kern.ssl_sendfile.truncate
Error Message:
Test case body timed out
FAILED: sys.kern.ssl_sendfile.grow
Error Message:
Test case body timed out
FAILED: sys.net.if_wg.wg_basic_crossaf
Error Message:
atf-check failed; see the output of the test for details
FAILED: sys.net.if_lagg_test.witness
Error Message:
Lock-order reversals involving if_lagg.c detected
FAILED: sys.netinet.udp_bindings.connect_bound_socket_from_2address_jail
Error Message:
/usr/src/tests/sys/netinet/udp_bindings.c:244: connect(s, (struct sockaddr *)&sin, sizeof(sin)) == 0 not met
FAILED: sys.netlink.netlink_socket.overflow
Error Message:
/usr/src/tests/sys/netlink/netlink_socket.c:146: send(fd, &hdr, sizeof(hdr), 0) == sizeof(hdr) not met