FreeBSD-main-amd64-test - Build #29537 - Still Unstable
Date: Tue, 22 Sep 2026 06:01:44 UTC
FreeBSD-main-amd64-test - Build #29537 (30c20ca26e105cffc5f37a95964cd9b2cad1b6cd) - Still Unstable
Build information: https://ci.FreeBSD.org/job/FreeBSD-main-amd64-test/29537/
Full change log: https://ci.FreeBSD.org/job/FreeBSD-main-amd64-test/29537/changes
Full build log: https://ci.FreeBSD.org/job/FreeBSD-main-amd64-test/29537/console
Status explanation:
"Unstable" - some tests are suspected being broken by the following changes
"Still Unstable" - the failing test cases have not been fixed by these
following changes and this is a notification to note that
these changes have not been fully tested by the CI system
Change summaries:
(Those commits are likely but not certainly responsible)
fecb9537a83b6746bc731a7cb3bcf6a33df79562 by markj:
udp: Let jail policy rewrite the dstaddr for v6 sendto()s
e20ed58d265cd6eba9b28efc8e8956324937d4c3 by markj:
lockf: Truncate the active lock list earlier in lf_purgelocks()
d95b62db76b9bb4d51bc5e555b26a3aaf8afa44a by andrew:
arm64: Add a wfe function
0bcd0616ff86675869d998a491eccc38e413cdad by andrew:
arm64/smmu: Move smmu later
6dca6e2aa89d877cf2bc8135c6936008e2a6af72 by andrew:
arm64/smmu: Start handling errata
54393bf5361a653c530170da20323181e515d7a1 by andrew:
arm64/smmu: Split out waiting for sync completion
0689a5ea451bdef62f7e81ffb3e5f580c5c99b2b by andrew:
arm64/smmu: Support polling for sync completion
50e01b6351b1a4955814cce021852c65a5b5bb9f by andrew:
arm64/smmu: Only MSI poll when cache-coherent
6a34abbe976626019d61d9d08a624f4ed14ddbd0 by kp:
pfsync: when importing a state clear take the interface name into
acaab48a73229c54ca1b4ec197508285c3f97970 by ziaee:
ufoma: Describe better, short SYNOPSIS, tag SPDX
0a81077f432d74dd2d064fb5f2b1b2a546be5347 by ziaee:
ufshci.4: Canonicalize SYNOPSIS, LOADER TUNABLES
8943d47938216bfe5e162aaf237f27de2e3ce659 by ziaee:
ugen.4: Canonicalize SYNOPSIS + tag SPDX
51234535ddd6ec0afe9dd4e3f34a31b92d5cdd78 by novel:
bhyveload: validate character disk devices
3330226fd33ae6b747c9edc97315244360ad5e54 by markj:
vmm: Normalize a zero PIT count before starting channel 0
d400b1ca31fd9b12655c83f9a7b3e8cdb68646dd by markj:
vmm: Synchronize long-mode state when emulating CR0 writes
ce5b70657f94d2051566664d3ea7167d104803b0 by markj:
vmm: Fix a page wiring leak in MOVS emulation
fc44154841fc2ebb1530a10cad719edb58559a88 by markj:
vmm: Re-arm the PIT callout for square wave mode
6a075798bfdfc5ff50fc635fe8c2acbbee0178f2 by ziaee:
ugold.4: Canonicalize SYNOPSIS, HARDWARE, tag SPDX
7d1edc5b36805f8fb80a75583c8e820ab58c9b7f by ziaee:
uhid.4: Canonicalize SYNOPSIS, tag SPDX
2407b84c683582ad2fb8840df5a13637d0a8f405 by ziaee:
uhso.4: describe better, SYNOPSIS, HARDWARE, SPDX
00d693e47efd305cfc011ffe85972483f4fe12f8 by ziaee:
ufoma.4: Improve HARDWARE introductory sentence
b27a221ef79d6d77d6173897f12118e1126453d8 by novel:
bhyve: fix boot device ordering
f1a4ac4aca47b2b6ac7ed4a06a6f3b0f253f13f3 by ziaee:
uipaq.4: Canonicalize SYNOPSIS, tag SPDX
f4e7e5eced392b90fb265b06f4223c0301d777ff by ziaee:
ukbd.4: Canonicalize SYNOPSIS, tag SPDX
1b9aea382e31f1c72bdfefbe01db51dc7bd60952 by siva:
gh-bc/tests: run tests in parallel
64a73d1b6dc93d92daea1e2d0603fda1dddadf4a by kib:
amd64/*sigtramp.S: re-enable some cfi annotations for special registers
46d383af0dbdb3871354f344b9c1ba99da691121 by bnovkov:
pciconf: Add -C option to filter by class name
6204c60fc043925555ef9da3a1872a43d5c709df by ziaee:
uled.4: Canonicalize SYNOPSIS, tag SPDX
b952821be787253f230c920dad7118ef5339cda5 by ziaee:
ulpt.4: Canonicalize SYNOPSIS, tag SPDX
71a0ea70234d58292bdf4b1dfad4f81511bd3457 by ziaee:
umcs.4: Describe better, canonicalize SYNOPSIS
2784767077f318b46871c0b0b013d9eab61ef5df by ziaee:
umct.4: Canonicalize SYNOPSIS, HARDWARE, tag SPDX
9257ae7294cecb5cdb8e808f7e50732f487339ef by ngie:
Add entries for third-party projects I maintain
e67697869e7208e4fe5eb96ce3f3d1240b44d2e1 by mhorne:
eqos: Reduce RX error noisiness
c745fccd9b2647c1f84f8e38b3992640ea34c50d by mhorne:
riscv: enable gpiopower driver
8a0cab240f2146a000396c411df471df4b75bb9d by mhorne:
hwpmc/amd: replace static pmcdesc[] and pc_amdpmcs[] with dynamic
5a2328a17851ac609ab6c786d9b0db388f15e6b3 by cperciva:
vmimage.subr: Include dangling symlinks in images
30c20ca26e105cffc5f37a95964cd9b2cad1b6cd by ngie:
Remove Dtrace/ZFS tests if their knobs are disabled
The failed test cases:
8 tests failed.
FAILED: lib.libexecinfo.sigtramp_test.test_backtrace_sigtramp
Error Message:
/usr/src/lib/libexecinfo/tests/sigtramp_test.c:30: n > 1 not met
FAILED: sys.kern.ssl_sendfile.eagain_vs_eof
Error Message:
/usr/src/tests/sys/kern/ssl_sendfile.c:485: c.sbytes == -1 not met
FAILED: sys.kern.ssl_sendfile.truncate
Error Message:
Test case body timed out
FAILED: sys.kern.ssl_sendfile.grow
Error Message:
Test case body timed out
FAILED: sys.net.if_wg.wg_basic_crossaf
Error Message:
atf-check failed; see the output of the test for details
FAILED: sys.net.if_lagg_test.witness
Error Message:
Lock-order reversals involving if_lagg.c detected
FAILED: sys.netinet.udp_bindings.connect_bound_socket_from_2address_jail
Error Message:
/usr/src/tests/sys/netinet/udp_bindings.c:244: connect(s, (struct sockaddr *)&sin, sizeof(sin)) == 0 not met
FAILED: sys.netlink.netlink_socket.overflow
Error Message:
/usr/src/tests/sys/netlink/netlink_socket.c:146: send(fd, &hdr, sizeof(hdr), 0) == sizeof(hdr) not met