FreeBSD-main-amd64-test - Build #29529 - Still Unstable
Date: Sat, 19 Sep 2026 20:38:51 UTC
FreeBSD-main-amd64-test - Build #29529 (7008192726a30d2d5f8ed912554cc53d7bcf9fba) - Still Unstable
Build information: https://ci.FreeBSD.org/job/FreeBSD-main-amd64-test/29529/
Full change log: https://ci.FreeBSD.org/job/FreeBSD-main-amd64-test/29529/changes
Full build log: https://ci.FreeBSD.org/job/FreeBSD-main-amd64-test/29529/console
Status explanation:
"Unstable" - some tests are suspected being broken by the following changes
"Still Unstable" - the failing test cases have not been fixed by these
following changes and this is a notification to note that
these changes have not been fully tested by the CI system
Change summaries:
(Those commits are likely but not certainly responsible)
7008192726a30d2d5f8ed912554cc53d7bcf9fba by 0mp:
dtrace_pid.4: Add example "Listing Program's Function Entries"
The failed test cases:
8 tests failed.
FAILED: sys.netpfil.pf.mbuf.inet6_in_mbuf_len
Error Message:
atf-check failed; see the output of the test for details
FAILED: sys.kern.ssl_sendfile.truncate
Error Message:
Test case body timed out
FAILED: sys.kern.ssl_sendfile.grow
Error Message:
Test case body timed out
FAILED: sys.net.if_wg.wg_basic_crossaf
Error Message:
atf-check failed; see the output of the test for details
FAILED: sys.netpfil.pf.pfsync.bulk
Error Message:
state not found on synced host
FAILED: sys.net.if_lagg_test.witness
Error Message:
Lock-order reversals involving if_lagg.c detected
FAILED: sys.netinet.udp_bindings.connect_bound_socket_from_2address_jail
Error Message:
/usr/src/tests/sys/netinet/udp_bindings.c:244: connect(s, (struct sockaddr *)&sin, sizeof(sin)) == 0 not met
FAILED: sys.netlink.netlink_socket.overflow
Error Message:
/usr/src/tests/sys/netlink/netlink_socket.c:146: send(fd, &hdr, sizeof(hdr), 0) == sizeof(hdr) not met