FreeBSD-main-amd64-test - Build #29528 - Still Unstable
Date: Sat, 19 Sep 2026 18:01:33 UTC
FreeBSD-main-amd64-test - Build #29528 (47f9e665078210cf15cc3914611dccabda6084a4) - Still Unstable
Build information: https://ci.FreeBSD.org/job/FreeBSD-main-amd64-test/29528/
Full change log: https://ci.FreeBSD.org/job/FreeBSD-main-amd64-test/29528/changes
Full build log: https://ci.FreeBSD.org/job/FreeBSD-main-amd64-test/29528/console
Status explanation:
"Unstable" - some tests are suspected being broken by the following changes
"Still Unstable" - the failing test cases have not been fixed by these
following changes and this is a notification to note that
these changes have not been fully tested by the CI system
Change summaries:
(Those commits are likely but not certainly responsible)
225612c76d870aa6467853fbafcbe34e8296d0d9 by kfv:
dd(1): Preserve const qualifier on bsearch(3) results
066fad8aefcb5bda77482c526757712ad0637aa9 by kfv:
ed(1): Preserve const qualifier on strchr(3) result
cc61cc7b638a6a1182c0dd0989a7b630759f408c by kfv:
ls(1): Preserve const qualifier on strstr(3) result
47f9e665078210cf15cc3914611dccabda6084a4 by kfv:
pkg(7): Preserve const qualifier on strrchr(3) results
The failed test cases:
10 tests failed.
FAILED: sys.kern.ssl_sendfile.eagain_vs_eof
Error Message:
/usr/src/tests/sys/kern/ssl_sendfile.c:485: c.sbytes == -1 not met
FAILED: sys.kern.timerfd.timerfd__periodic_timer_performance
Error Message:
Test case body timed out
FAILED: sys.kern.ssl_sendfile.truncate
Error Message:
Test case body timed out
FAILED: sys.kern.ssl_sendfile.grow
Error Message:
Test case body timed out
FAILED: sys.netpfil.pf.syncookie.basic_v6
Error Message:
Failed to connect to syncookie protected echo daemon
FAILED: sys.net.if_wg.wg_basic_crossaf
Error Message:
atf-check failed; see the output of the test for details
FAILED: sys.netpfil.pf.pfsync.bulk
Error Message:
state not found on synced host
FAILED: sys.net.if_lagg_test.witness
Error Message:
Lock-order reversals involving if_lagg.c detected
FAILED: sys.netinet.udp_bindings.connect_bound_socket_from_2address_jail
Error Message:
/usr/src/tests/sys/netinet/udp_bindings.c:244: connect(s, (struct sockaddr *)&sin, sizeof(sin)) == 0 not met
FAILED: sys.netlink.netlink_socket.overflow
Error Message:
/usr/src/tests/sys/netlink/netlink_socket.c:146: send(fd, &hdr, sizeof(hdr), 0) == sizeof(hdr) not met