FreeBSD-main-amd64-test - Build #29510 - Still Unstable

From: <jenkins-admin_at_FreeBSD.org>
Date: Thu, 17 Sep 2026 01:46:40 UTC
FreeBSD-main-amd64-test - Build #29510 (5f68acc931a4814c4ee46124aaa5afff22402f61) - Still Unstable

Build information: https://ci.FreeBSD.org/job/FreeBSD-main-amd64-test/29510/
Full change log: https://ci.FreeBSD.org/job/FreeBSD-main-amd64-test/29510/changes
Full build log: https://ci.FreeBSD.org/job/FreeBSD-main-amd64-test/29510/console

Status explanation:
"Unstable" - some tests are suspected being broken by the following changes
"Still Unstable" - the failing test cases have not been fixed by these
                   following changes and this is a notification to note that
                   these changes have not been fully tested by the CI system

Change summaries:
(Those commits are likely but not certainly responsible)

c6728cf5850da500af177b2bb326dc29a32fc450 by gallatin:
iflib: implement driver-provided queue selection for simple tx

5f68acc931a4814c4ee46124aaa5afff22402f61 by obiwac:
acpi: Warn if no amdsmu(4) loaded after suspend-to-idle resume



The failed test cases:

3 tests failed.
FAILED:  sys.net.if_lagg_test.witness

Error Message:
Lock-order reversals involving if_lagg.c detected

FAILED:  sys.netinet.udp_bindings.connect_bound_socket_from_2address_jail

Error Message:
/usr/src/tests/sys/netinet/udp_bindings.c:244: connect(s, (struct sockaddr *)&sin, sizeof(sin)) == 0 not met

FAILED:  sys.netlink.netlink_socket.overflow

Error Message:
/usr/src/tests/sys/netlink/netlink_socket.c:146: send(fd, &hdr, sizeof(hdr), 0) == sizeof(hdr) not met