FreeBSD-main-amd64-test - Build #29509 - Still Unstable

From: <jenkins-admin_at_FreeBSD.org>
Date: Wed, 16 Sep 2026 23:18:05 UTC
FreeBSD-main-amd64-test - Build #29509 (3484217cc47c1f77d2be2ed0e012b870d1cd3dca) - Still Unstable

Build information: https://ci.FreeBSD.org/job/FreeBSD-main-amd64-test/29509/
Full change log: https://ci.FreeBSD.org/job/FreeBSD-main-amd64-test/29509/changes
Full build log: https://ci.FreeBSD.org/job/FreeBSD-main-amd64-test/29509/console

Status explanation:
"Unstable" - some tests are suspected being broken by the following changes
"Still Unstable" - the failing test cases have not been fixed by these
                   following changes and this is a notification to note that
                   these changes have not been fully tested by the CI system

Change summaries:
(Those commits are likely but not certainly responsible)

151a8512bdeced5a4e84f4d9a36c16cd8b99e977 by kib:
truss(1): capsicumize

5d0b87669a91244e330a35fc973e6c60f92f6d1f by markj:
mac_bsdextended: reject negative rule indices in sysctl_rule()

3484217cc47c1f77d2be2ed0e012b870d1cd3dca by markj:
proc: free kstack buffers when debug permission changes



The failed test cases:

7 tests failed.
FAILED:  sys.fs.fusefs.ctl.remove_lun_with_atime

Error Message:
atf-check failed; see the output of the test for details

FAILED:  sys.netinet6.ndp.ndp_prefix_lifetime

Error Message:
atf-check failed; see the output of the test for details

FAILED:  sys.netpfil.pf.syncookie.basic_v6

Error Message:
Failed to connect to syncookie protected echo daemon

FAILED:  sys.netpfil.pf.pfsync.bulk

Error Message:
state not found on synced host

FAILED:  sys.net.if_lagg_test.witness

Error Message:
Lock-order reversals involving if_lagg.c detected

FAILED:  sys.netinet.udp_bindings.connect_bound_socket_from_2address_jail

Error Message:
/usr/src/tests/sys/netinet/udp_bindings.c:244: connect(s, (struct sockaddr *)&sin, sizeof(sin)) == 0 not met

FAILED:  sys.netlink.netlink_socket.overflow

Error Message:
/usr/src/tests/sys/netlink/netlink_socket.c:146: send(fd, &hdr, sizeof(hdr), 0) == sizeof(hdr) not met