FreeBSD-main-amd64-test - Build #29504 - Still Unstable
Date: Wed, 16 Sep 2026 10:05:28 UTC
FreeBSD-main-amd64-test - Build #29504 (87c44c0b0fc7ffd4d360d36e0156847e24a2636e) - Still Unstable
Build information: https://ci.FreeBSD.org/job/FreeBSD-main-amd64-test/29504/
Full change log: https://ci.FreeBSD.org/job/FreeBSD-main-amd64-test/29504/changes
Full build log: https://ci.FreeBSD.org/job/FreeBSD-main-amd64-test/29504/console
Status explanation:
"Unstable" - some tests are suspected being broken by the following changes
"Still Unstable" - the failing test cases have not been fixed by these
following changes and this is a notification to note that
these changes have not been fully tested by the CI system
Change summaries:
(Those commits are likely but not certainly responsible)
d5ae08ff06240ca889010be9799e158efaa06322 by kbowling:
iflib: Use the framework run-state accessor in drivers
ea71fa99827ad4b7099de87e41e7af39ee1c10f6 by kbowling:
e1000: Express TSO restart policy without OACTIVE
7f8feee5ab922e6645f4061e9ca29109411aadef by kbowling:
iflib: Clear simple-TX quiescence before publishing admission
87c44c0b0fc7ffd4d360d36e0156847e24a2636e by jhibbits:
libsys: Export kexec_load
The failed test cases:
4 tests failed.
FAILED: usr.sbin.sysrc.sysrc_test.A_flag
Error Message:
atf-check failed; see the output of the test for details
FAILED: sys.net.if_lagg_test.witness
Error Message:
Lock-order reversals involving if_lagg.c detected
FAILED: sys.netinet.udp_bindings.connect_bound_socket_from_2address_jail
Error Message:
/usr/src/tests/sys/netinet/udp_bindings.c:244: connect(s, (struct sockaddr *)&sin, sizeof(sin)) == 0 not met
FAILED: sys.netlink.netlink_socket.overflow
Error Message:
/usr/src/tests/sys/netlink/netlink_socket.c:146: send(fd, &hdr, sizeof(hdr), 0) == sizeof(hdr) not met