FreeBSD-main-amd64-test - Build #29503 - Still Unstable
Date: Wed, 16 Sep 2026 07:39:24 UTC
FreeBSD-main-amd64-test - Build #29503 (4b5e09be147c7303147b1742845ffe4417c4aabf) - Still Unstable
Build information: https://ci.FreeBSD.org/job/FreeBSD-main-amd64-test/29503/
Full change log: https://ci.FreeBSD.org/job/FreeBSD-main-amd64-test/29503/changes
Full build log: https://ci.FreeBSD.org/job/FreeBSD-main-amd64-test/29503/console
Status explanation:
"Unstable" - some tests are suspected being broken by the following changes
"Still Unstable" - the failing test cases have not been fixed by these
following changes and this is a notification to note that
these changes have not been fully tested by the CI system
Change summaries:
(Those commits are likely but not certainly responsible)
7fb00406ebf53e07273d0914a5f36ff6fb78c185 by kbowling:
iflib: Use private lifecycle state for control work
4b5e09be147c7303147b1742845ffe4417c4aabf by kbowling:
iflib: Separate software admission from legacy driver flags
The failed test cases:
5 tests failed.
FAILED: sys.netinet6.ndp.ndp_prefix_lifetime
Error Message:
atf-check failed; see the output of the test for details
FAILED: usr.sbin.sysrc.sysrc_test.A_flag
Error Message:
atf-check failed; see the output of the test for details
FAILED: sys.net.if_lagg_test.witness
Error Message:
Lock-order reversals involving if_lagg.c detected
FAILED: sys.netinet.udp_bindings.connect_bound_socket_from_2address_jail
Error Message:
/usr/src/tests/sys/netinet/udp_bindings.c:244: connect(s, (struct sockaddr *)&sin, sizeof(sin)) == 0 not met
FAILED: sys.netlink.netlink_socket.overflow
Error Message:
/usr/src/tests/sys/netlink/netlink_socket.c:146: send(fd, &hdr, sizeof(hdr), 0) == sizeof(hdr) not met