FreeBSD-main-amd64-test - Build #29819 - Still unstable

From: <jenkins-admin_at_FreeBSD.org>
Date: Wed, 28 Oct 2026 03:24:36 UTC
FreeBSD-main-amd64-test - Build #29819 (f2d4370fbbe6a24b663a4151e3a462e8e2c306c6) - Still unstable

Build information: https://ci.FreeBSD.org/job/FreeBSD-main-amd64-test/29819/
Full change log: https://ci.FreeBSD.org/job/FreeBSD-main-amd64-test/29819/changes
Full build log: https://ci.FreeBSD.org/job/FreeBSD-main-amd64-test/29819/console

Status explanation:
"Unstable" - some tests are suspected being broken by the following changes
"Still Unstable" - the failing test cases have not been fixed by these
                   following changes and this is a notification to note that
                   these changes have not been fully tested by the CI system

Change summaries:
(Those commits are likely but not certainly responsible)

f2d4370fbbe6a24b663a4151e3a462e8e2c306c6 by glebius:
ipfw: declare the ipfw_nat module



The failed test cases:

31 tests failed.
FAILED:  lib.libarchive.functional_test.test_archive_read_append_filter

Error Message:
atf-check failed; see the output of the test for details

FAILED:  lib.libarchive.functional_test.test_archive_write_add_filter_by_name_grzip

Error Message:
atf-check failed; see the output of the test for details

FAILED:  lib.libarchive.functional_test.test_archive_write_add_filter_by_name_lrzip

Error Message:
atf-check failed; see the output of the test for details

FAILED:  lib.libarchive.functional_test.test_archive_write_add_filter_by_name_lz4

Error Message:
atf-check failed; see the output of the test for details

FAILED:  lib.libarchive.functional_test.test_archive_write_add_filter_by_name_lzop

Error Message:
atf-check failed; see the output of the test for details

FAILED:  lib.libarchive.functional_test.test_archive_write_add_filter_grzip

Error Message:
atf-check failed; see the output of the test for details

FAILED:  lib.libarchive.functional_test.test_archive_write_add_filter_lrzip

Error Message:
atf-check failed; see the output of the test for details

FAILED:  lib.libarchive.functional_test.test_archive_write_add_filter_lz4

Error Message:
atf-check failed; see the output of the test for details

FAILED:  lib.libarchive.functional_test.test_archive_write_add_filter_lzop

Error Message:
atf-check failed; see the output of the test for details

FAILED:  lib.libarchive.functional_test.test_read_append_filter_program

Error Message:
atf-check failed; see the output of the test for details

FAILED:  lib.libarchive.functional_test.test_read_append_filter_wrong_program

Error Message:
atf-check failed; see the output of the test for details

FAILED:  lib.libarchive.functional_test.test_read_append_lz4_filter

Error Message:
atf-check failed; see the output of the test for details

FAILED:  lib.libarchive.functional_test.test_write_filter_lz4

Error Message:
atf-check failed; see the output of the test for details

FAILED:  lib.libarchive.functional_test.test_write_filter_lz4_block_dependence

Error Message:
atf-check failed; see the output of the test for details

FAILED:  lib.libarchive.functional_test.test_write_filter_lz4_block_size_4

Error Message:
atf-check failed; see the output of the test for details

FAILED:  lib.libarchive.functional_test.test_write_filter_lz4_block_size_5

Error Message:
atf-check failed; see the output of the test for details

FAILED:  lib.libarchive.functional_test.test_write_filter_lz4_block_size_6

Error Message:
atf-check failed; see the output of the test for details

FAILED:  lib.libarchive.functional_test.test_write_filter_lz4_disable_stream_checksum

Error Message:
atf-check failed; see the output of the test for details

FAILED:  lib.libarchive.functional_test.test_write_filter_lz4_empty_archive

Error Message:
atf-check failed; see the output of the test for details

FAILED:  lib.libarchive.functional_test.test_write_filter_lz4_enable_block_checksum

Error Message:
atf-check failed; see the output of the test for details

FAILED:  usr.bin.bsdcat.functional_test.test_empty_lz4

Error Message:
atf-check failed; see the output of the test for details

FAILED:  usr.bin.bsdcat.functional_test.test_expand_lz4

Error Message:
atf-check failed; see the output of the test for details

FAILED:  usr.bin.cpio.functional_test.test_extract_cpio_lz4

Error Message:
atf-check failed; see the output of the test for details

FAILED:  usr.bin.tar.functional_test.test_extract_tar_lz4

Error Message:
atf-check failed; see the output of the test for details

FAILED:  sys.kern.ssl_sendfile.grow

Error Message:
Test case body timed out

FAILED:  sys.kern.ssl_sendfile.eagain_vs_eof

Error Message:
/usr/src/tests/sys/kern/ssl_sendfile.c:485: c.sbytes == -1 not met

FAILED:  sys.kern.ssl_sendfile.truncate

Error Message:
Test case body timed out

FAILED:  sbin.dhclient.functional.py.__test_cases_list__

Error Message:
Test case list wrote to stderr

FAILED:  sys.net.if_lagg_test.witness

Error Message:
Lock-order reversals involving if_lagg.c detected

FAILED:  sys.netinet.udp_bindings.connect_bound_socket_from_2address_jail

Error Message:
/usr/src/tests/sys/netinet/udp_bindings.c:244: connect(s, (struct sockaddr *)&sin, sizeof(sin)) == 0 not met

FAILED:  sys.netlink.netlink_socket.overflow

Error Message:
/usr/src/tests/sys/netlink/netlink_socket.c:146: send(fd, &hdr, sizeof(hdr), 0) == sizeof(hdr) not met