FreeBSD-main-amd64-test - Build #29776 - Still Unstable

From: <jenkins-admin_at_FreeBSD.org>
Date: Thu, 22 Oct 2026 23:10:05 UTC
FreeBSD-main-amd64-test - Build #29776 (ceb575553b222a310346f6a98b3c39bff49cb069) - Still Unstable

Build information: https://ci.FreeBSD.org/job/FreeBSD-main-amd64-test/29776/
Full change log: https://ci.FreeBSD.org/job/FreeBSD-main-amd64-test/29776/changes
Full build log: https://ci.FreeBSD.org/job/FreeBSD-main-amd64-test/29776/console

Status explanation:
"Unstable" - some tests are suspected being broken by the following changes
"Still Unstable" - the failing test cases have not been fixed by these
                   following changes and this is a notification to note that
                   these changes have not been fully tested by the CI system

Change summaries:
(Those commits are likely but not certainly responsible)

44961edac85505ddd7d6670b8e0bfba9cbb7c70b by kib:
termios.4: clarify the behavior on the last close of controlling

e8923c7346a882418352683f72e7c4f8e68d6907 by kib:
devfs: make persistent controlling terminal an ABI property

ec1754a677a0bebb735d752583ad625150114eee by ngie:
diff: diff regular files when `-q` is specified again

e48eb1c5c47fa3e0814f161f17ccf5de98470fe5 by longros:
mailmap: Add entry for longros

ef7d7011ce2fa48ab072c5e802ac00ccb25c4c48 by gallatin:
arm64: Fix EFI runtime mappings with 16K pages

f69099fc0fc55262741621451a52de50f164271a by emaste:
if_media: Add 100BASE-T1 and 1000BASE-T1 media types

ceb575553b222a310346f6a98b3c39bff49cb069 by gallatin:
arm64: enable ossl accelerated AES-GCM on arm64



The failed test cases:

9 tests failed.
FAILED:  sys.netinet6.ndp.ndp_prefix_lifetime

Error Message:
atf-check failed; see the output of the test for details

FAILED:  sys.kern.ssl_sendfile.eagain_vs_eof

Error Message:
/usr/src/tests/sys/kern/ssl_sendfile.c:485: c.sbytes == -1 not met

FAILED:  sys.kern.ssl_sendfile.grow

Error Message:
Test case body timed out

FAILED:  sys.kern.ssl_sendfile.truncate

Error Message:
Test case body timed out

FAILED:  sbin.dhclient.functional.py.__test_cases_list__

Error Message:
Test case list wrote to stderr

FAILED:  lib.libexecinfo.sigtramp_test.test_backtrace_sigtramp

Error Message:
/usr/src/lib/libexecinfo/tests/sigtramp_test.c:30: n > 1 not met

FAILED:  sys.net.if_lagg_test.witness

Error Message:
Lock-order reversals involving if_lagg.c detected

FAILED:  sys.netinet.udp_bindings.connect_bound_socket_from_2address_jail

Error Message:
/usr/src/tests/sys/netinet/udp_bindings.c:244: connect(s, (struct sockaddr *)&sin, sizeof(sin)) == 0 not met

FAILED:  sys.netlink.netlink_socket.overflow

Error Message:
/usr/src/tests/sys/netlink/netlink_socket.c:146: send(fd, &hdr, sizeof(hdr), 0) == sizeof(hdr) not met