FreeBSD-main-amd64-test - Build #29775 - Still Unstable
Date: Thu, 22 Oct 2026 20:35:12 UTC
FreeBSD-main-amd64-test - Build #29775 (07ab87b60d08c665eab0b187e81a239145f9961d) - Still Unstable
Build information: https://ci.FreeBSD.org/job/FreeBSD-main-amd64-test/29775/
Full change log: https://ci.FreeBSD.org/job/FreeBSD-main-amd64-test/29775/changes
Full build log: https://ci.FreeBSD.org/job/FreeBSD-main-amd64-test/29775/console
Status explanation:
"Unstable" - some tests are suspected being broken by the following changes
"Still Unstable" - the failing test cases have not been fixed by these
following changes and this is a notification to note that
these changes have not been fully tested by the CI system
Change summaries:
(Those commits are likely but not certainly responsible)
b83bd6fec075f4acf614283cd66a691111847881 by olce:
x86: ipi_bitmap_handler(): Preempt last, reduce critical section
3a0e2ca3eecd3176fa7dd139e59913a67c858ac9 by olce:
x86: ipi_bitmap_handler(): Account for IPIs correctly on COUNT_IPIS
07ab87b60d08c665eab0b187e81a239145f9961d by olce:
powerpc: powerpc_ipi_handler(): Stop first, preempt last
The failed test cases:
9 tests failed.
FAILED: sys.kern.ssl_sendfile.eagain_vs_eof
Error Message:
/usr/src/tests/sys/kern/ssl_sendfile.c:485: c.sbytes == -1 not met
FAILED: sys.kern.ssl_sendfile.grow
Error Message:
Test case body timed out
FAILED: sys.kern.ssl_sendfile.truncate
Error Message:
Test case body timed out
FAILED: sbin.dhclient.functional.py.__test_cases_list__
Error Message:
Test case list wrote to stderr
FAILED: usr.bin.diff.diff_test.conflicting_format
Error Message:
atf-check failed; see the output of the test for details
FAILED: lib.libexecinfo.sigtramp_test.test_backtrace_sigtramp
Error Message:
/usr/src/lib/libexecinfo/tests/sigtramp_test.c:30: n > 1 not met
FAILED: sys.net.if_lagg_test.witness
Error Message:
Lock-order reversals involving if_lagg.c detected
FAILED: sys.netinet.udp_bindings.connect_bound_socket_from_2address_jail
Error Message:
/usr/src/tests/sys/netinet/udp_bindings.c:244: connect(s, (struct sockaddr *)&sin, sizeof(sin)) == 0 not met
FAILED: sys.netlink.netlink_socket.overflow
Error Message:
/usr/src/tests/sys/netlink/netlink_socket.c:146: send(fd, &hdr, sizeof(hdr), 0) == sizeof(hdr) not met