FreeBSD-main-amd64-test - Build #29765 - Still Unstable
Date: Wed, 21 Oct 2026 20:46:42 UTC
FreeBSD-main-amd64-test - Build #29765 (e45c7bc6115ef3cd9567a397e1351c608c0269a7) - Still Unstable
Build information: https://ci.FreeBSD.org/job/FreeBSD-main-amd64-test/29765/
Full change log: https://ci.FreeBSD.org/job/FreeBSD-main-amd64-test/29765/changes
Full build log: https://ci.FreeBSD.org/job/FreeBSD-main-amd64-test/29765/console
Status explanation:
"Unstable" - some tests are suspected being broken by the following changes
"Still Unstable" - the failing test cases have not been fixed by these
following changes and this is a notification to note that
these changes have not been fully tested by the CI system
Change summaries:
(Those commits are likely but not certainly responsible)
96944ab79acd48d8a552e6b1229fc46361e65341 by rcm:
pfctl: Report why a table definition failed
c91539772b07cb78369626716a4ddf92cf6caa5f by rcm:
pflow: Destroy exporters on module unload
e45c7bc6115ef3cd9567a397e1351c608c0269a7 by ngie:
linux: implement sched_getattr()
The failed test cases:
10 tests failed.
FAILED: sys.netpfil.pf.pfsync.bulk
Error Message:
state not found on synced host
FAILED: sys.kern.ssl_sendfile.eagain_vs_eof
Error Message:
/usr/src/tests/sys/kern/ssl_sendfile.c:485: c.sbytes == -1 not met
FAILED: sys.kern.ssl_sendfile.grow
Error Message:
Test case body timed out
FAILED: sys.kern.ssl_sendfile.truncate
Error Message:
Test case body timed out
FAILED: sbin.dhclient.functional.py.__test_cases_list__
Error Message:
Test case list wrote to stderr
FAILED: usr.bin.diff.diff_test.conflicting_format
Error Message:
atf-check failed; see the output of the test for details
FAILED: lib.libexecinfo.sigtramp_test.test_backtrace_sigtramp
Error Message:
/usr/src/lib/libexecinfo/tests/sigtramp_test.c:30: n > 1 not met
FAILED: sys.net.if_lagg_test.witness
Error Message:
Lock-order reversals involving if_lagg.c detected
FAILED: sys.netinet.udp_bindings.connect_bound_socket_from_2address_jail
Error Message:
/usr/src/tests/sys/netinet/udp_bindings.c:244: connect(s, (struct sockaddr *)&sin, sizeof(sin)) == 0 not met
FAILED: sys.netlink.netlink_socket.overflow
Error Message:
/usr/src/tests/sys/netlink/netlink_socket.c:146: send(fd, &hdr, sizeof(hdr), 0) == sizeof(hdr) not met