FreeBSD-main-amd64-test - Build #29764 - Still Unstable
Date: Wed, 21 Oct 2026 18:14:06 UTC
FreeBSD-main-amd64-test - Build #29764 (067c6da5ce046e24024f27fa2be7270929865ed3) - Still Unstable
Build information: https://ci.FreeBSD.org/job/FreeBSD-main-amd64-test/29764/
Full change log: https://ci.FreeBSD.org/job/FreeBSD-main-amd64-test/29764/changes
Full build log: https://ci.FreeBSD.org/job/FreeBSD-main-amd64-test/29764/console
Status explanation:
"Unstable" - some tests are suspected being broken by the following changes
"Still Unstable" - the failing test cases have not been fixed by these
following changes and this is a notification to note that
these changes have not been fully tested by the CI system
Change summaries:
(Those commits are likely but not certainly responsible)
1594fbd7f2f4c1af3262d1abd8cb100be2fed414 by rcm:
pfctl: Report the error of a failed fingerprint flush
4488a4f0486c1c766f5e9498a524c379a5ad7add by glebius:
inpcb: make ipport_randomized static
daca1e12bb99e795bf96b6ef4d069fd35c85ddac by ziaee:
pmc.perf.3: Mark only for amd64 architecture
d2df0d4eb5c0e9915abf8c96c22adb051d33cbe2 by ziaee:
networking.7: Scope netif to wlan0
36804775d3541266d721d2549d05e74fc160a8cf by ziaee:
armv8crypto: Canonicalize document description
067c6da5ce046e24024f27fa2be7270929865ed3 by ziaee:
ossl.4: Canonicalize HARDWARE and add powerpc64
The failed test cases:
10 tests failed.
FAILED: sys.netpfil.pf.pfsync.bulk
Error Message:
state not found on synced host
FAILED: sys.kern.ssl_sendfile.eagain_vs_eof
Error Message:
/usr/src/tests/sys/kern/ssl_sendfile.c:485: c.sbytes == -1 not met
FAILED: sys.kern.ssl_sendfile.grow
Error Message:
Test case body timed out
FAILED: sys.kern.ssl_sendfile.truncate
Error Message:
Test case body timed out
FAILED: sbin.dhclient.functional.py.__test_cases_list__
Error Message:
Test case list wrote to stderr
FAILED: usr.bin.diff.diff_test.conflicting_format
Error Message:
atf-check failed; see the output of the test for details
FAILED: lib.libexecinfo.sigtramp_test.test_backtrace_sigtramp
Error Message:
/usr/src/lib/libexecinfo/tests/sigtramp_test.c:30: n > 1 not met
FAILED: sys.net.if_lagg_test.witness
Error Message:
Lock-order reversals involving if_lagg.c detected
FAILED: sys.netinet.udp_bindings.connect_bound_socket_from_2address_jail
Error Message:
/usr/src/tests/sys/netinet/udp_bindings.c:244: connect(s, (struct sockaddr *)&sin, sizeof(sin)) == 0 not met
FAILED: sys.netlink.netlink_socket.overflow
Error Message:
/usr/src/tests/sys/netlink/netlink_socket.c:146: send(fd, &hdr, sizeof(hdr), 0) == sizeof(hdr) not met