FreeBSD-main-amd64-test - Build #29762 - Still Unstable
Date: Wed, 21 Oct 2026 12:56:45 UTC
FreeBSD-main-amd64-test - Build #29762 (f2bba019216648c634a41ac4381fc62801905c41) - Still Unstable
Build information: https://ci.FreeBSD.org/job/FreeBSD-main-amd64-test/29762/
Full change log: https://ci.FreeBSD.org/job/FreeBSD-main-amd64-test/29762/changes
Full build log: https://ci.FreeBSD.org/job/FreeBSD-main-amd64-test/29762/console
Status explanation:
"Unstable" - some tests are suspected being broken by the following changes
"Still Unstable" - the failing test cases have not been fixed by these
following changes and this is a notification to note that
these changes have not been fully tested by the CI system
Change summaries:
(Those commits are likely but not certainly responsible)
4c72b1c36dda72b9ba8de593cac2c94e15f42bcf by glebius:
ng_pppoe: fix m_pullup() logic
671babc79497587ef5a59f58578f8fce9359398c by glebius:
mbuf: make m_pullup() an inline over most expected case
41356c80179c708b6a49eabf1be9cedd6bca4444 by glebius:
net*: use inlined m_pullup()
bc9e66886a2537d4536e24353669ef1a21105b70 by glebius:
ipfw: gc disabled old hashing code
f2bba019216648c634a41ac4381fc62801905c41 by glebius:
ipfw: keep flag(s) definition next to member that holds them
The failed test cases:
10 tests failed.
FAILED: sys.netinet6.ndp.ndp_prefix_lifetime
Error Message:
atf-check failed; see the output of the test for details
FAILED: sys.kern.ssl_sendfile.eagain_vs_eof
Error Message:
/usr/src/tests/sys/kern/ssl_sendfile.c:485: c.sbytes == -1 not met
FAILED: sys.kern.ssl_sendfile.grow
Error Message:
Test case body timed out
FAILED: sys.kern.ssl_sendfile.truncate
Error Message:
Test case body timed out
FAILED: sbin.dhclient.functional.py.__test_cases_list__
Error Message:
Test case list wrote to stderr
FAILED: usr.bin.diff.diff_test.conflicting_format
Error Message:
atf-check failed; see the output of the test for details
FAILED: lib.libexecinfo.sigtramp_test.test_backtrace_sigtramp
Error Message:
/usr/src/lib/libexecinfo/tests/sigtramp_test.c:30: n > 1 not met
FAILED: sys.net.if_lagg_test.witness
Error Message:
Lock-order reversals involving if_lagg.c detected
FAILED: sys.netinet.udp_bindings.connect_bound_socket_from_2address_jail
Error Message:
/usr/src/tests/sys/netinet/udp_bindings.c:244: connect(s, (struct sockaddr *)&sin, sizeof(sin)) == 0 not met
FAILED: sys.netlink.netlink_socket.overflow
Error Message:
/usr/src/tests/sys/netlink/netlink_socket.c:146: send(fd, &hdr, sizeof(hdr), 0) == sizeof(hdr) not met