FreeBSD-main-amd64-test - Build #29761 - Still Unstable

From: <jenkins-admin_at_FreeBSD.org>
Date: Wed, 21 Oct 2026 10:24:19 UTC
FreeBSD-main-amd64-test - Build #29761 (32f7bddb443ad7ddc72fa65ab0eb3a3658703cc7) - Still Unstable

Build information: https://ci.FreeBSD.org/job/FreeBSD-main-amd64-test/29761/
Full change log: https://ci.FreeBSD.org/job/FreeBSD-main-amd64-test/29761/changes
Full build log: https://ci.FreeBSD.org/job/FreeBSD-main-amd64-test/29761/console

Status explanation:
"Unstable" - some tests are suspected being broken by the following changes
"Still Unstable" - the failing test cases have not been fixed by these
                   following changes and this is a notification to note that
                   these changes have not been fully tested by the CI system

Change summaries:
(Those commits are likely but not certainly responsible)

b37e8ffbd9d4c46c4dc36842a9721fa766e0e61e by seuros:
uart: support Meteor Lake-P LPSS UART 0

6690cbdc649e7d0b23d96e1490b72068fc791a95 by seuros:
intel: add a shared header for the LPSS private registers

ad37abf653f77c59ce6c296eda9976c74c905d2e by markj:
kmsan: Add a required forward type declaration

de80428118101624aaeaae02d59665d1027ff10e by markj:
inotify: Open target the directory when adding a watch

55d0e022fbcd83ec5a29fe5751af85e2c3ebf19b by markj:
bhyveload: Factor global variables into a software context

f1986e5b88630b1404a202251499bca0f97f5f06 by markj:
bhyve: Fix virtio-input event array resizing

32f7bddb443ad7ddc72fa65ab0eb3a3658703cc7 by markj:
amd64: Don't probe MSR_IRPERF when running under bhyve



The failed test cases:

10 tests failed.
FAILED:  sys.netpfil.pf.igmp.py.TestIGMP::test_ip_opts

Error Message:
/usr/local/lib/python3.12/site-packages/scapy/packet.py:1985: AttributeError

FAILED:  sys.kern.ssl_sendfile.eagain_vs_eof

Error Message:
/usr/src/tests/sys/kern/ssl_sendfile.c:485: c.sbytes == -1 not met

FAILED:  sys.kern.ssl_sendfile.grow

Error Message:
Test case body timed out

FAILED:  sys.kern.ssl_sendfile.truncate

Error Message:
Test case body timed out

FAILED:  sbin.dhclient.functional.py.__test_cases_list__

Error Message:
Test case list wrote to stderr

FAILED:  usr.bin.diff.diff_test.conflicting_format

Error Message:
atf-check failed; see the output of the test for details

FAILED:  lib.libexecinfo.sigtramp_test.test_backtrace_sigtramp

Error Message:
/usr/src/lib/libexecinfo/tests/sigtramp_test.c:30: n > 1 not met

FAILED:  sys.net.if_lagg_test.witness

Error Message:
Lock-order reversals involving if_lagg.c detected

FAILED:  sys.netinet.udp_bindings.connect_bound_socket_from_2address_jail

Error Message:
/usr/src/tests/sys/netinet/udp_bindings.c:244: connect(s, (struct sockaddr *)&sin, sizeof(sin)) == 0 not met

FAILED:  sys.netlink.netlink_socket.overflow

Error Message:
/usr/src/tests/sys/netlink/netlink_socket.c:146: send(fd, &hdr, sizeof(hdr), 0) == sizeof(hdr) not met