FreeBSD-main-amd64-test - Build #29701 - Still Unstable

From: <jenkins-admin_at_FreeBSD.org>
Date: Thu, 15 Oct 2026 09:27:54 UTC
FreeBSD-main-amd64-test - Build #29701 (a32c8dc6e8fd96e0d56e5add09638120e62d8418) - Still Unstable

Build information: https://ci.FreeBSD.org/job/FreeBSD-main-amd64-test/29701/
Full change log: https://ci.FreeBSD.org/job/FreeBSD-main-amd64-test/29701/changes
Full build log: https://ci.FreeBSD.org/job/FreeBSD-main-amd64-test/29701/console

Status explanation:
"Unstable" - some tests are suspected being broken by the following changes
"Still Unstable" - the failing test cases have not been fixed by these
                   following changes and this is a notification to note that
                   these changes have not been fully tested by the CI system

Change summaries:
(Those commits are likely but not certainly responsible)

6bc57500b8b700a3d9998fd417fdee653f93366d by rcm:
pf: Change source limiter tables from a task

a32c8dc6e8fd96e0d56e5add09638120e62d8418 by jbo:
u3g: Add ublox LARA-L6 modem



The failed test cases:

8 tests failed.
FAILED:  sys.netpfil.pf.pfsync.bulk

Error Message:
state not found on synced host

FAILED:  sys.kern.ssl_sendfile.truncate

Error Message:
Test case body timed out

FAILED:  sys.kern.ssl_sendfile.eagain_vs_eof

Error Message:
/usr/src/tests/sys/kern/ssl_sendfile.c:485: c.sbytes == -1 not met

FAILED:  sys.kern.ssl_sendfile.grow

Error Message:
Test case body timed out

FAILED:  lib.libexecinfo.sigtramp_test.test_backtrace_sigtramp

Error Message:
/usr/src/lib/libexecinfo/tests/sigtramp_test.c:30: n > 1 not met

FAILED:  sys.net.if_lagg_test.witness

Error Message:
Lock-order reversals involving if_lagg.c detected

FAILED:  sys.netinet.udp_bindings.connect_bound_socket_from_2address_jail

Error Message:
/usr/src/tests/sys/netinet/udp_bindings.c:244: connect(s, (struct sockaddr *)&sin, sizeof(sin)) == 0 not met

FAILED:  sys.netlink.netlink_socket.overflow

Error Message:
/usr/src/tests/sys/netlink/netlink_socket.c:146: send(fd, &hdr, sizeof(hdr), 0) == sizeof(hdr) not met