FreeBSD-main-amd64-test - Build #29700 - Still Unstable
Date: Thu, 15 Oct 2026 06:49:01 UTC
FreeBSD-main-amd64-test - Build #29700 (b4d2c9835c0edfddd1d6742afa86d4873ccfad16) - Still Unstable
Build information: https://ci.FreeBSD.org/job/FreeBSD-main-amd64-test/29700/
Full change log: https://ci.FreeBSD.org/job/FreeBSD-main-amd64-test/29700/changes
Full build log: https://ci.FreeBSD.org/job/FreeBSD-main-amd64-test/29700/console
Status explanation:
"Unstable" - some tests are suspected being broken by the following changes
"Still Unstable" - the failing test cases have not been fixed by these
following changes and this is a notification to note that
these changes have not been fully tested by the CI system
Change summaries:
(Those commits are likely but not certainly responsible)
25f04bf42786806e2661b7a09c283b83f568380a by kp:
pf: do not free the caller's ruleset when attaching a table fails
ccb19b359aae4b7e7315ad61d33d9a35d85849d1 by kp:
pf: check extension header length.
b4d2c9835c0edfddd1d6742afa86d4873ccfad16 by kp:
pf: check AH header length.
The failed test cases:
7 tests failed.
FAILED: sys.kern.ssl_sendfile.truncate
Error Message:
Test case body timed out
FAILED: sys.kern.ssl_sendfile.eagain_vs_eof
Error Message:
/usr/src/tests/sys/kern/ssl_sendfile.c:485: c.sbytes == -1 not met
FAILED: sys.kern.ssl_sendfile.grow
Error Message:
Test case body timed out
FAILED: lib.libexecinfo.sigtramp_test.test_backtrace_sigtramp
Error Message:
/usr/src/lib/libexecinfo/tests/sigtramp_test.c:30: n > 1 not met
FAILED: sys.net.if_lagg_test.witness
Error Message:
Lock-order reversals involving if_lagg.c detected
FAILED: sys.netinet.udp_bindings.connect_bound_socket_from_2address_jail
Error Message:
/usr/src/tests/sys/netinet/udp_bindings.c:244: connect(s, (struct sockaddr *)&sin, sizeof(sin)) == 0 not met
FAILED: sys.netlink.netlink_socket.overflow
Error Message:
/usr/src/tests/sys/netlink/netlink_socket.c:146: send(fd, &hdr, sizeof(hdr), 0) == sizeof(hdr) not met