FreeBSD-main-amd64-test - Build #29629 - Still Unstable

From: <jenkins-admin_at_FreeBSD.org>
Date: Tue, 06 Oct 2026 10:39:23 UTC
FreeBSD-main-amd64-test - Build #29629 (bb5f10e51bd53771f1a438f36f554256fcbd7d08) - Still Unstable

Build information: https://ci.FreeBSD.org/job/FreeBSD-main-amd64-test/29629/
Full change log: https://ci.FreeBSD.org/job/FreeBSD-main-amd64-test/29629/changes
Full build log: https://ci.FreeBSD.org/job/FreeBSD-main-amd64-test/29629/console

Status explanation:
"Unstable" - some tests are suspected being broken by the following changes
"Still Unstable" - the failing test cases have not been fixed by these
                   following changes and this is a notification to note that
                   these changes have not been fully tested by the CI system

Change summaries:
(Those commits are likely but not certainly responsible)

850d4562928ea9308dd9188d5014bcabe7049938 by kib:
cdevsw: add D_NONPASSABLE flag

499901dd7a0afc77745ede85c4e6ec063d43a84d by kib:
ufssuspend(4): mark non-passable

4bb60157646df86c77cea130c66f63f119947709 by markj:
netinet: Deprecate OSIOCAIFADDR and OSIOCAIFADDR_IN6

bb5f10e51bd53771f1a438f36f554256fcbd7d08 by ngie:
linux: implement sched_getattr()



The failed test cases:

7 tests failed.
FAILED:  sys.kern.ssl_sendfile.eagain_vs_eof

Error Message:
/usr/src/tests/sys/kern/ssl_sendfile.c:485: c.sbytes == -1 not met

FAILED:  sys.kern.ssl_sendfile.grow

Error Message:
Test case body timed out

FAILED:  sys.kern.ssl_sendfile.truncate

Error Message:
Test case body timed out

FAILED:  lib.libexecinfo.sigtramp_test.test_backtrace_sigtramp

Error Message:
/usr/src/lib/libexecinfo/tests/sigtramp_test.c:30: n > 1 not met

FAILED:  sys.net.if_lagg_test.witness

Error Message:
Lock-order reversals involving if_lagg.c detected

FAILED:  sys.netinet.udp_bindings.connect_bound_socket_from_2address_jail

Error Message:
/usr/src/tests/sys/netinet/udp_bindings.c:244: connect(s, (struct sockaddr *)&sin, sizeof(sin)) == 0 not met

FAILED:  sys.netlink.netlink_socket.overflow

Error Message:
/usr/src/tests/sys/netlink/netlink_socket.c:146: send(fd, &hdr, sizeof(hdr), 0) == sizeof(hdr) not met