FreeBSD-main-amd64-test - Build #29628 - Still Unstable
Date: Tue, 06 Oct 2026 08:01:13 UTC
FreeBSD-main-amd64-test - Build #29628 (481447ad9be2e60e0bb3744ab199ce121baadf84) - Still Unstable
Build information: https://ci.FreeBSD.org/job/FreeBSD-main-amd64-test/29628/
Full change log: https://ci.FreeBSD.org/job/FreeBSD-main-amd64-test/29628/changes
Full build log: https://ci.FreeBSD.org/job/FreeBSD-main-amd64-test/29628/console
Status explanation:
"Unstable" - some tests are suspected being broken by the following changes
"Still Unstable" - the failing test cases have not been fixed by these
following changes and this is a notification to note that
these changes have not been fully tested by the CI system
Change summaries:
(Those commits are likely but not certainly responsible)
152dd1a0ee3076be117e7897c666df95a5a4447d by antoine:
ObsoleteFiles.inc: add more obsolete files
b45d14d3d665e0253391924e5c0595c259b8a773 by siva:
sys.mk: CTFMERGE: don't assume objfiles always have CTF sections
481447ad9be2e60e0bb3744ab199ce121baadf84 by rcm:
e1000: Fix the flow control sysctl
The failed test cases:
7 tests failed.
FAILED: sys.kern.ssl_sendfile.eagain_vs_eof
Error Message:
/usr/src/tests/sys/kern/ssl_sendfile.c:485: c.sbytes == -1 not met
FAILED: sys.kern.ssl_sendfile.grow
Error Message:
Test case body timed out
FAILED: sys.kern.ssl_sendfile.truncate
Error Message:
Test case body timed out
FAILED: lib.libexecinfo.sigtramp_test.test_backtrace_sigtramp
Error Message:
/usr/src/lib/libexecinfo/tests/sigtramp_test.c:30: n > 1 not met
FAILED: sys.net.if_lagg_test.witness
Error Message:
Lock-order reversals involving if_lagg.c detected
FAILED: sys.netinet.udp_bindings.connect_bound_socket_from_2address_jail
Error Message:
/usr/src/tests/sys/netinet/udp_bindings.c:244: connect(s, (struct sockaddr *)&sin, sizeof(sin)) == 0 not met
FAILED: sys.netlink.netlink_socket.overflow
Error Message:
/usr/src/tests/sys/netlink/netlink_socket.c:146: send(fd, &hdr, sizeof(hdr), 0) == sizeof(hdr) not met