FreeBSD-stable-15-amd64-test - Build #1137 - Still Unstable
Date: Thu, 01 Oct 2026 12:19:24 UTC
FreeBSD-stable-15-amd64-test - Build #1137 (2670aa4807f04c484c4f5449b6fa25d98c4b8961) - Still Unstable
Build information: https://ci.FreeBSD.org/job/FreeBSD-stable-15-amd64-test/1137/
Full change log: https://ci.FreeBSD.org/job/FreeBSD-stable-15-amd64-test/1137/changes
Full build log: https://ci.FreeBSD.org/job/FreeBSD-stable-15-amd64-test/1137/console
Status explanation:
"Unstable" - some tests are suspected being broken by the following changes
"Still Unstable" - the failing test cases have not been fixed by these
following changes and this is a notification to note that
these changes have not been fully tested by the CI system
Change summaries:
(Those commits are likely but not certainly responsible)
b97734d7f6d4983e54653ebca189be2fe69c8f38 by ngie:
crypto/openssl: update to 3.5.9
a3190104fa5cfab6a9a05735342c164492bbdc69 by ngie:
crypto/openssl: update generated files to match 3.5.9 release content
6dcc931d2b004aac7e92246fb004eb0547343bed by ngie:
contrib/lutok: update from 0.4 to 0.6.2
16c0b57749250ada1fc4021edb9b0a2c28349ae1 by ngie:
contrib/lutok: remove autotools generated files
a9103f8f07cbdd5c2f69475b053fd41b31b1425d by pkubaj:
llan: byte swap the receive queue entries
2670aa4807f04c484c4f5449b6fa25d98c4b8961 by 0mp:
sdiff.1: Document exit status and --help
The failed test cases:
5 tests failed.
FAILED: sys.netpfil.pf.pfsync.bulk
Error Message:
state not found on synced host
FAILED: sys.pmc.pmc_api_test.another_owners_id
Error Message:
1 checks failed; see output for more details
FAILED: sys.pmc.pmc_api_test.never_allocated_id
Error Message:
3 checks failed; see output for more details
FAILED: sys.pmc.pmc_api_test.released_id
Error Message:
1 checks failed; see output for more details
FAILED: lib.libexecinfo.sigtramp_test.test_backtrace_sigtramp
Error Message:
/usr/src/lib/libexecinfo/tests/sigtramp_test.c:30: n > 1 not met