FreeBSD-stable-15-amd64-test - Build #1136 - Still Unstable

From: <jenkins-admin_at_FreeBSD.org>
Date: Thu, 01 Oct 2026 10:07:26 UTC
FreeBSD-stable-15-amd64-test - Build #1136 (98329e26a7f15d0e0b0da0eb47f9106dd4aa2352) - Still Unstable

Build information: https://ci.FreeBSD.org/job/FreeBSD-stable-15-amd64-test/1136/
Full change log: https://ci.FreeBSD.org/job/FreeBSD-stable-15-amd64-test/1136/changes
Full build log: https://ci.FreeBSD.org/job/FreeBSD-stable-15-amd64-test/1136/console

Status explanation:
"Unstable" - some tests are suspected being broken by the following changes
"Still Unstable" - the failing test cases have not been fixed by these
                   following changes and this is a notification to note that
                   these changes have not been fully tested by the CI system

Change summaries:
(Those commits are likely but not certainly responsible)

299197df10be4449ae97fb7082e6d2e92c197d53 by netchild:
hwpmc tests: sort the list of test programs

8ba25f084d0470a655b1ddf07e489ebb8c9b15cc by netchild:
hwpmc: add regression tests for a credential-changing exec

24b4ea09496d715c6848925d0bf097893844465f by netchild:
hwpmc: add tests for handle validation and the privilege boundaries

7fc003779456c0af02910d7941e943772f7f0e57 by netchild:
hwpmc tests: process-attachment lifecycle and ownership cases

913328f5c7843e47635ef53604de088fa58ec955 by netchild:
hwpmc: add credential-transition exec tests (keep and drop)

63b3fdee04163d2b95203e262f7a994d57cff0a2 by netchild:
hwpmc tests: the sampling log file

430287781dea25174e34fc9834143e7e2d30c4c3 by kib:
g_vfs_close_unlocked(9): wrapper around g_vfs_close(9)

c363f72719373c5dfd304929967112a036c89ba4 by kib:
filesystems: use g_vfs_close_unlocked(9)

592ed51533a2e333efbe48277af9b6530de139d6 by kib:
VFS: require locked vnode for fsync()

a30ea6460ac63110312030db5f0a372eeb4507b6 by kib:
VFS: style

98329e26a7f15d0e0b0da0eb47f9106dd4aa2352 by ngie:
asmc.4: clean up/modernize manpage



The failed test cases:

4 tests failed.
FAILED:  sys.pmc.pmc_api_test.another_owners_id

Error Message:
1 checks failed; see output for more details

FAILED:  sys.pmc.pmc_api_test.never_allocated_id

Error Message:
3 checks failed; see output for more details

FAILED:  sys.pmc.pmc_api_test.released_id

Error Message:
1 checks failed; see output for more details

FAILED:  lib.libexecinfo.sigtramp_test.test_backtrace_sigtramp

Error Message:
/usr/src/lib/libexecinfo/tests/sigtramp_test.c:30: n > 1 not met