FreeBSD-main-amd64-test - Build #26522 - Still Unstable

From: <jenkins-admin_at_FreeBSD.org>
Date: Fri, 06 Jun 2025 05:01:25 UTC
FreeBSD-main-amd64-test - Build #26522 (7b3ee39e73af36f49f471f7900baeb98ac3504d0) - Still Unstable

Build information: https://ci.FreeBSD.org/job/FreeBSD-main-amd64-test/26522/
Full change log: https://ci.FreeBSD.org/job/FreeBSD-main-amd64-test/26522/changes
Full build log: https://ci.FreeBSD.org/job/FreeBSD-main-amd64-test/26522/console

Status explanation:
"Unstable" - some tests are suspected being broken by the following changes
"Still Unstable" - the failing test cases have not been fixed by these
                   following changes and this is a notification to note that
                   these changes have not been fully tested by the CI system

Change summaries:
(Those commits are likely but not certainly responsible)

60159a98a83747e539eb14c6a0eaaa1875e2cacc by jhb:
nvme: Move opcode and status code tables from base CAM to nvme_util.c

85a6ba310f05139cdbdb2bc852e5a5fbe7975bfa by jhb:
nvme: Use routines from nvme_util.c to decode opcodes and status codes

152372a30ab73f1f947748febdd5b397189f4284 by jhb:
Fix incorrect syntax in sys/conf/files for nvmf_transport.c

35c4ea02cb9fe199dd88b19cf51fef56838c8cba by asomers:
fusefs: revert a workaround for a googletest bug

7ce93195ddb30b371022ae3adbd9bd24189e1444 by asomers:
fusefs: delete dead code

46fce000843215ff3d574d1c24fc24771975973e by markj:
gve: Fix timestamp invalidation for DQO queue formats

b63f298b1ff90d9c25dee09df7fdd0e509185587 by kib:
pseudofs: fix typo in comment

e9897199576a40360440aa4d2aa48d61c4010f11 by kib:
pseudofs: make dup name an error instead of panic

8e35800732573de6c4bc1dd3ac420447fca96231 by brooks:
build: remove the last vestiges of lint support

934df0ca61bfbb6bdedba8588457a3ffa2adde25 by brooks:
mman: Reserve two PROT_ for CHERI use

7b3ee39e73af36f49f471f7900baeb98ac3504d0 by jhb:
libcam: Include nvme opcode and status code routines from nvme_util.c



The failed test cases:

8 tests failed.
FAILED:  sys.opencrypto.runtests.main

Error Message:
1 of 1 tests failed

FAILED:  lib.libc.gen.glob2_test.glob_callback_test

Error Message:
/usr/src/lib/libc/tests/gen/glob2_test.c:152: glob(3) failed to invoke callback function

FAILED:  lib.libc.gen.glob_blocks_test.glob_b_callback_test

Error Message:
/usr/src/lib/libc/tests/gen/glob_blocks_test.c:35: glob(3) failed to invoke callback block

FAILED:  sys.netpfil.pf.sctp.related_icmp

Error Message:
atf-check failed; see the output of the test for details

FAILED:  sys.netgraph.ksocket.udp_bind

Error Message:
/usr/src/tests/sys/netgraph/ksocket.c:104: connect(us, (struct sockaddr *)rep->data, sizeof(struct sockaddr_in)) == 0 not met

FAILED:  sys.netgraph.ksocket.udp_connect

Error Message:
/usr/src/tests/sys/netgraph/ksocket.c:72: NgSendMsg(cs, ".:" OURHOOK, NGM_KSOCKET_COOKIE, NGM_KSOCKET_CONNECT, &sa, sizeof(sa)) >= 0 not met

FAILED:  sys.netinet.broadcast.INADDR_BROADCAST

Error Message:
/usr/src/tests/sys/netinet/broadcast.c:65: sending of broadcast failed: 51

FAILED:  sys.netinet.fibs_test.same_ip_multiple_ifaces_fib0

Error Message:
atf-check failed; see the output of the test for details