FreeBSD-main-amd64-test - Build #26521 - Still Unstable
Date: Thu, 05 Jun 2025 17:56:54 UTC
FreeBSD-main-amd64-test - Build #26521 (fa02d9fceab7d452d5b3312a89b4e7b95529edcd) - Still Unstable
Build information: https://ci.FreeBSD.org/job/FreeBSD-main-amd64-test/26521/
Full change log: https://ci.FreeBSD.org/job/FreeBSD-main-amd64-test/26521/changes
Full build log: https://ci.FreeBSD.org/job/FreeBSD-main-amd64-test/26521/console
Status explanation:
"Unstable" - some tests are suspected being broken by the following changes
"Still Unstable" - the failing test cases have not been fixed by these
following changes and this is a notification to note that
these changes have not been fully tested by the CI system
Change summaries:
(Those commits are likely but not certainly responsible)
58dae28f665b32650f452730378693de40e96d68 by bz:
LinuxKPI: 802.11: make synching from HT more resilient
29ddd583693aced69be48b545e1c7e7249bdfb9c by bz:
LinuxKPI: 802.11: add support for GCMP hw crypto offload
aaee0ed3d163a1d29ea74d7e4d2c3658a51cfb27 by bz:
LinuxKPI: 802.11: WEP noise
173bbdba8f5197f5514100846727726b0875a39a by bz:
net80211: add more information elements (IEs) definitions
beb51893cc292f24b3284b1465a58cba4c3059d7 by bz:
net80211: update IE list for 802.11-2020
fa02d9fceab7d452d5b3312a89b4e7b95529edcd by bz:
net80211: add the beginning of the extfield information elements (IE
The failed test cases:
10 tests failed.
FAILED: lib.libcasper.services.cap_fileargs.fileargs_test.fileargs__fopen_write
Error Message:
/usr/src/lib/libcasper/services/cap_fileargs/tests/fileargs_test.c:528: test_file_fopen(fa, files[i], "w", &pfile) == 0 not met
FAILED: sys.kqueue.libkqueue.kqueue_test.main
Error Message:
Received signal 6
FAILED: sys.netpfil.pf.mbuf.inet6_in_mbuf_len
Error Message:
1 != 2 (1 != 2)
FAILED: lib.libc.gen.glob2_test.glob_callback_test
Error Message:
/usr/src/lib/libc/tests/gen/glob2_test.c:152: glob(3) failed to invoke callback function
FAILED: lib.libc.gen.glob_blocks_test.glob_b_callback_test
Error Message:
/usr/src/lib/libc/tests/gen/glob_blocks_test.c:35: glob(3) failed to invoke callback block
FAILED: sys.netpfil.pf.sctp.related_icmp
Error Message:
atf-check failed; see the output of the test for details
FAILED: sys.netgraph.ksocket.udp_bind
Error Message:
/usr/src/tests/sys/netgraph/ksocket.c:104: connect(us, (struct sockaddr *)rep->data, sizeof(struct sockaddr_in)) == 0 not met
FAILED: sys.netgraph.ksocket.udp_connect
Error Message:
/usr/src/tests/sys/netgraph/ksocket.c:72: NgSendMsg(cs, ".:" OURHOOK, NGM_KSOCKET_COOKIE, NGM_KSOCKET_CONNECT, &sa, sizeof(sa)) >= 0 not met
FAILED: sys.netinet.broadcast.INADDR_BROADCAST
Error Message:
/usr/src/tests/sys/netinet/broadcast.c:65: sending of broadcast failed: 51
FAILED: sys.netinet.fibs_test.same_ip_multiple_ifaces_fib0
Error Message:
atf-check failed; see the output of the test for details