FreeBSD-main-amd64-test - Build #25905 - Still Unstable
Date: Tue, 14 Jan 2025 21:07:33 UTC
FreeBSD-main-amd64-test - Build #25905 (e8ec28047df5185582a95c5211ed75682fad5ec5) - Still Unstable
Build information: https://ci.FreeBSD.org/job/FreeBSD-main-amd64-test/25905/
Full change log: https://ci.FreeBSD.org/job/FreeBSD-main-amd64-test/25905/changes
Full build log: https://ci.FreeBSD.org/job/FreeBSD-main-amd64-test/25905/console
Status explanation:
"Unstable" - some tests are suspected being broken by the following changes
"Still Unstable" - the failing test cases have not been fixed by these
following changes and this is a notification to note that
these changes have not been fully tested by the CI system
Change summaries:
(Those commits are likely but not certainly responsible)
061727efe1e355fb2fde1b05e92718543d05bfe7 by tuexen:
TCP BBR: remove dead code
e8ec28047df5185582a95c5211ed75682fad5ec5 by tuexen:
TCP RACK: fix TCP_RACK_PACING_BETA socket option
The failed test cases:
4 tests failed.
FAILED: lib.csu.dynamiclib.cxx_constructors.__test_cases_list__
Error Message:
Test program did not exit cleanly
FAILED: lib.csu.dynamiclib.fini_test.__test_cases_list__
Error Message:
Test program did not exit cleanly
FAILED: lib.csu.dynamiclib.init_test.__test_cases_list__
Error Message:
Test program did not exit cleanly
FAILED: sys.net.routing.test_routing_l3.py.TestIfOps::test_change_prefix_route[inet]
Error Message:
/usr/tests/sys/net/routing/test_routing_l3.py:42: AssertionError