FreeBSD-main-amd64-test - Build #25904 - Still Unstable
Date: Tue, 14 Jan 2025 19:29:04 UTC
FreeBSD-main-amd64-test - Build #25904 (c28fefe1dc44b69743dd18d038440da38a2867a7) - Still Unstable
Build information: https://ci.FreeBSD.org/job/FreeBSD-main-amd64-test/25904/
Full change log: https://ci.FreeBSD.org/job/FreeBSD-main-amd64-test/25904/changes
Full build log: https://ci.FreeBSD.org/job/FreeBSD-main-amd64-test/25904/console
Status explanation:
"Unstable" - some tests are suspected being broken by the following changes
"Still Unstable" - the failing test cases have not been fixed by these
following changes and this is a notification to note that
these changes have not been fully tested by the CI system
Change summaries:
(Those commits are likely but not certainly responsible)
f415b2ef30f7bf0db753f09fbba7b0910475b0d2 by asomers:
fusefs: Coverity cleanup in the lseek tests
bb9525f30214e8b6c53c6cccd9e8f02e8f8e8c42 by tuexen:
TCP RACK: fix TCP fast open
c28fefe1dc44b69743dd18d038440da38a2867a7 by tuexen:
TCP BBR: remove dead code
The failed test cases:
4 tests failed.
FAILED: lib.csu.dynamiclib.cxx_constructors.__test_cases_list__
Error Message:
Test program did not exit cleanly
FAILED: lib.csu.dynamiclib.fini_test.__test_cases_list__
Error Message:
Test program did not exit cleanly
FAILED: lib.csu.dynamiclib.init_test.__test_cases_list__
Error Message:
Test program did not exit cleanly
FAILED: sys.net.routing.test_routing_l3.py.TestIfOps::test_change_prefix_route[inet]
Error Message:
/usr/tests/sys/net/routing/test_routing_l3.py:42: AssertionError