FreeBSD-main-amd64-test - Build #26273 - Still Unstable

From: <jenkins-admin_at_FreeBSD.org>
Date: Thu, 17 Apr 2025 21:52:30 UTC
FreeBSD-main-amd64-test - Build #26273 (93f4377caba08e4a47fb9f1878bf609bd4181564) - Still Unstable

Build information: https://ci.FreeBSD.org/job/FreeBSD-main-amd64-test/26273/
Full change log: https://ci.FreeBSD.org/job/FreeBSD-main-amd64-test/26273/changes
Full build log: https://ci.FreeBSD.org/job/FreeBSD-main-amd64-test/26273/console

Status explanation:
"Unstable" - some tests are suspected being broken by the following changes
"Still Unstable" - the failing test cases have not been fixed by these
                   following changes and this is a notification to note that
                   these changes have not been fully tested by the CI system

Change summaries:
(Those commits are likely but not certainly responsible)

983723943a5b7f1f249ba8f646b20e57ad524fed by dougm:
vm_pageout: rewrite cluster()

93f4377caba08e4a47fb9f1878bf609bd4181564 by ziaee:
msdosfs manuals: Improve visibility and linking



The failed test cases:

3 tests failed.
FAILED:  bin.pwait.pwait_test.time_unit

Error Message:
atf-check failed; see the output of the test for details

FAILED:  sys.netinet.broadcast.INADDR_BROADCAST

Error Message:
/usr/src/tests/sys/netinet/broadcast.c:65: sending of broadcast failed: 51

FAILED:  sys.netinet.fibs_test.same_ip_multiple_ifaces_fib0

Error Message:
atf-check failed; see the output of the test for details