FreeBSD-main-amd64-test - Build #26272 - Still Unstable
Date: Thu, 17 Apr 2025 19:55:57 UTC
FreeBSD-main-amd64-test - Build #26272 (3b2f0bfc35167724a41c969c1823be6b1ede15ab) - Still Unstable
Build information: https://ci.FreeBSD.org/job/FreeBSD-main-amd64-test/26272/
Full change log: https://ci.FreeBSD.org/job/FreeBSD-main-amd64-test/26272/changes
Full build log: https://ci.FreeBSD.org/job/FreeBSD-main-amd64-test/26272/console
Status explanation:
"Unstable" - some tests are suspected being broken by the following changes
"Still Unstable" - the failing test cases have not been fixed by these
following changes and this is a notification to note that
these changes have not been fully tested by the CI system
Change summaries:
(Those commits are likely but not certainly responsible)
3b2f0bfc35167724a41c969c1823be6b1ede15ab by kib:
Add POSIX psiginfo(3) call
The failed test cases:
3 tests failed.
FAILED: bin.pwait.pwait_test.time_unit
Error Message:
atf-check failed; see the output of the test for details
FAILED: sys.netinet.broadcast.INADDR_BROADCAST
Error Message:
/usr/src/tests/sys/netinet/broadcast.c:65: sending of broadcast failed: 51
FAILED: sys.netinet.fibs_test.same_ip_multiple_ifaces_fib0
Error Message:
atf-check failed; see the output of the test for details