FreeBSD-main-amd64-test - Build #24997 - Still Unstable

From: <>
Date: Wed, 27 Mar 2024 17:48:37 UTC
FreeBSD-main-amd64-test - Build #24997 (f43ff3e15c8b4b161ce09c8ab008abc4222db26b) - Still Unstable

Build information:
Full change log:
Full build log:

Status explanation:
"Unstable" - some tests are suspected being broken by the following changes
"Still Unstable" - the failing test cases have not been fixed by these
                   following changes and this is a notification to note that
                   these changes have not been fully tested by the CI system

Change summaries:
(Those commits are likely but not certainly responsible)

960d151eaa1ecde109accc30ca0c3306551d8e58 by kib:
x86: test the right CPUID bit when checking for XSAVEOPT support

e0c92dd2b7e62e4f8281c9ad1d31465bb32f9e3b by kib:
amd64: initialize td_frame stack area for init(8) main thread

f43ff3e15c8b4b161ce09c8ab008abc4222db26b by zlei:
kern linker: Do not unload a module if it has dependants

The failed test cases:

3 tests failed.
FAILED:  sys.netinet.arp.static

Error Message:
atf-check failed; see the output of the test for details

FAILED:  sys.fs.tmpfs.times_test.empty

Error Message:
Test case was expecting a failure but none were raised

FAILED:  cddl.usr.sbin.zfsd.zfsd_unittest.main

Error Message:
Received signal 6