FreeBSD-main-amd64-test - Build #24996 - Still Unstable

From: <>
Date: Wed, 27 Mar 2024 00:42:00 UTC
FreeBSD-main-amd64-test - Build #24996 (7dc5c6c4120ee6d5a028a1e01cdc1bfbe9499634) - Still Unstable

Build information:
Full change log:
Full build log:

Status explanation:
"Unstable" - some tests are suspected being broken by the following changes
"Still Unstable" - the failing test cases have not been fixed by these
                   following changes and this is a notification to note that
                   these changes have not been fully tested by the CI system

Change summaries:
(Those commits are likely but not certainly responsible)

7dc5c6c4120ee6d5a028a1e01cdc1bfbe9499634 by emaste:
bsdlabel: add BUGS section documenting 8 partition limit

The failed test cases:

4 tests failed.
FAILED:  sys.netinet6.lpm6.lpm6_test2_success

Error Message:
atf-check failed; see the output of the test for details


Error Message:
/usr/tests/atf_python/sys/net/ IndexError

FAILED:  sys.fs.tmpfs.times_test.empty

Error Message:
Test case was expecting a failure but none were raised

FAILED:  cddl.usr.sbin.zfsd.zfsd_unittest.main

Error Message:
Received signal 6