FreeBSD-main-amd64-test - Build #24974 - Still Unstable

From: <>
Date: Fri, 22 Mar 2024 01:01:50 UTC
FreeBSD-main-amd64-test - Build #24974 (139d114acc7b57a6cc839fe5ee935d25ecd9f3a2) - Still Unstable

Build information:
Full change log:
Full build log:

Status explanation:
"Unstable" - some tests are suspected being broken by the following changes
"Still Unstable" - the failing test cases have not been fixed by these
                   following changes and this is a notification to note that
                   these changes have not been fully tested by the CI system

Change summaries:
(Those commits are likely but not certainly responsible)

f0620ceeccf070a69352105c5dbc23cff499a732 by dim:
Fix building of several libclang_rt libraries for powerpc64 and

3f72f36cf2f92e00a248f729d50803232ff4cef8 by mhorne:
assert.3: Update manual page based on mandoc -Tlint

139d114acc7b57a6cc839fe5ee935d25ecd9f3a2 by sjg:
libsysdecode use MKTABLES_INCLUDEDIR

The failed test cases:

3 tests failed.
FAILED:  sys.netpfil.common.dummynet.pf_queue

Error Message:
We failed prioritisation 1 times

FAILED:  sys.fs.tmpfs.times_test.empty

Error Message:
Test case was expecting a failure but none were raised

FAILED:  cddl.usr.sbin.zfsd.zfsd_unittest.main

Error Message:
Received signal 6