FreeBSD-main-amd64-test - Build #24973 - Still Unstable

From: <>
Date: Thu, 21 Mar 2024 23:32:38 UTC
FreeBSD-main-amd64-test - Build #24973 (173953182af060dcab43990e179ee91e9f2d1e54) - Still Unstable

Build information:
Full change log:
Full build log:

Status explanation:
"Unstable" - some tests are suspected being broken by the following changes
"Still Unstable" - the failing test cases have not been fixed by these
                   following changes and this is a notification to note that
                   these changes have not been fully tested by the CI system

Change summaries:
(Those commits are likely but not certainly responsible)

501f7e7bf847c66e3869b533805e76897e4685b9 by mhorne:
em.4: add interfaces to name section

8b864151856fbba97fed16b1200248cf9f6f3ccf by mhorne:
cp: Remove useless ssize_t cast

cc1268a926772900a08c61fd791bb66df1e6c30c by mhorne:
BSD.usr.dist: remove empty /usr/libdata/gcc directory

83a426d13a6a384e63e75d8252c03dd40af3817e by mhorne:
KASSERT(9): add assertion message guidelines

5d956e11ed3713ff769d51b71f7b4ee6ce0085fe by mhorne:
KASSERT(9): describe history of MPASS

36de8bb226671ef9fe373d8d95f77cdb76157738 by mhorne:
kassert.h: update MPASS definition commentary

173953182af060dcab43990e179ee91e9f2d1e54 by se:
rtld-elf: add some debug print statements

The failed test cases:

3 tests failed.
FAILED:  sys.netinet6.lpm6.lpm6_test1_success

Error Message:
atf-check failed; see the output of the test for details

FAILED:  sys.fs.tmpfs.times_test.empty

Error Message:
Test case was expecting a failure but none were raised

FAILED:  cddl.usr.sbin.zfsd.zfsd_unittest.main

Error Message:
Received signal 6