FreeBSD-main-amd64-test - Build #24945 - Still Unstable

From: <>
Date: Fri, 15 Mar 2024 23:22:37 UTC
FreeBSD-main-amd64-test - Build #24945 (2497c70f81b757b8a4e6b642d242f713ecca17fa) - Still Unstable

Build information:
Full change log:
Full build log:

Status explanation:
"Unstable" - some tests are suspected being broken by the following changes
"Still Unstable" - the failing test cases have not been fixed by these
                   following changes and this is a notification to note that
                   these changes have not been fully tested by the CI system

Change summaries:
(Those commits are likely but not certainly responsible)

eab7ae7811f6ce2db7721774b1a2b4f6db1d7f8c by jhb:
arm64 gicv3: Use void pointers instead of vm_offset_t

1e3f42b6bad58f001b9c88404bd818991f34d398 by jhb:
arm64: Switch the address argument to cpu_*cache* to a pointer

66658b0f2775824b2a80fb56ca15e6ceae2f8240 by jhb:
arm busdma: Fix parameter types to exclusion_bounce_check

e48770de6831dc152aaeb2c0b70fcfb2a346bb89 by jhb:
arm64: Use void pointers for arguments to arm64_get_writable_addr

2497c70f81b757b8a4e6b642d242f713ecca17fa by glebius:
vnet: remove unneeded backslash

The failed test cases:

3 tests failed.
FAILED:  sys.netpfil.common.dummynet.pf_pls_gilbert

Error Message:
atf-check failed; see the output of the test for details

FAILED:  sys.fs.tmpfs.times_test.empty

Error Message:
Test case was expecting a failure but none were raised

FAILED:  cddl.usr.sbin.zfsd.zfsd_unittest.main

Error Message:
Received signal 6